{"text_format":"1","workbook":"xlsx","n_sheets":5,"sheets":["Information Sheet","ROUND","SCORE CENTER","COURSES","ADMIN"],"not_rendered":{"charts":0,"images":7,"macros":1,"external_links":0,"defined_names":52,"comments":0,"pivot_tables":0},"unopened":[],"bounds":{"document_bytes":16777216,"sheet_cells":100000,"rows_first":2000,"rows_last":500,"rows_between":2000,"halvings":0,"cell_chars":16384,"cell_head_chars":4096},"cells_cut":0,"cells_raw":0,"read":"whole","date_system":"1900"}

{"sheet":"Information Sheet","index":0,"n_rows":7,"n_cols":4,"rows_kept":7,"cut":false,"hidden":false,"merged":[[0,0,0,2]]}
["Instructions:"]
[null,null,"Open up Round Sheet"]
[null,null,"Use set up score card button"]
[null,null,null,"Input name and golf course"]
[null,null,"Play a round of Golf and keep track of scores."]
[null,null,"Hit finalize results button"]
[null,null,"View Results and play another rounnd of GOLF!!!"]

{"sheet":"ROUND","index":1,"n_rows":77,"n_cols":51,"rows_kept":77,"cut":false,"hidden":false,"merged":[[11,50,11,53],[28,10,28,11],[29,10,29,11],[30,10,30,11],[26,0,26,3],[26,10,26,11],[24,0,25,11],[27,10,27,11],[26,4,26,5],[26,6,26,7],[26,8,26,9],[27,6,27,7],[27,1,27,3],[28,6,28,7],[29,6,29,7],[30,6,30,7],[27,8,27,9],[28,8,28,9],[29,8,29,9],[30,8,30,9],[28,1,28,3],[29,1,29,3],[30,1,30,3],[27,4,27,5],[28,4,28,5],[29,4,29,5],[30,4,30,5],[6,0,6,2],[16,0,16,2],[4,0,5,2],[4,23,5,23],[4,24,5,24],[4,21,5,21],[4,22,5,22],[4,16,5,16],[4,17,5,17],[4,18,5,18],[4,13,5,13],[12,0,12,2],[13,0,13,2],[14,0,14,2],[15,0,15,2],[4,25,5,25],[0,3,3,25],[4,3,5,3],[4,4,5,4],[4,5,5,5],[4,6,5,6],[4,7,5,7],[4,8,5,8],[4,9,5,9],[4,10,5,10],[4,11,5,11],[4,12,5,12],[4,14,5,14],[4,15,5,15],[4,19,5,19],[4,20,5,20]]}
[null,null,null,"Gladstan Golf Course"]
[]
[]
[]
["HOLE",null,null,1,2,3,4,5,6,7,8,9,"OUT",null,10,11,12,13,14,15,16,17,18,"IN","TOT","HANDICAP"]
[]
["PAR",null,null,{"$f":"VLOOKUP(Coursename,courseinfo,94,FALSE)","v":4},{"$f":"VLOOKUP(Coursename,courseinfo,95,FALSE)","v":3},{"$f":"VLOOKUP(Coursename,courseinfo,96,FALSE)","v":4},{"$f":"VLOOKUP(Coursename,courseinfo,97,FALSE)","v":5},{"$f":"VLOOKUP(Coursename,courseinfo,98,FALSE)","v":4},{"$f":"VLOOKUP(Coursename,courseinfo,99,FALSE)","v":3},{"$f":"VLOOKUP(Coursename,courseinfo,100,FALSE)","v":4},{"$f":"VLOOKUP(Coursename,courseinfo,101,FALSE)","v":5},{"$f":"VLOOKUP(Coursename,courseinfo,102,FALSE)","v":4},{"$f":"SUM(D7:L7)","v":36},null,{"$f":"VLOOKUP(Coursename,courseinfo,103,FALSE)","v":4},{"$f":"VLOOKUP(Coursename,courseinfo,104,FALSE)","v":4},{"$f":"VLOOKUP(Coursename,courseinfo,105,FALSE)","v":4},{"$f":"VLOOKUP(Coursename,courseinfo,106,FALSE)","v":3},{"$f":"VLOOKUP(Coursename,courseinfo,107,FALSE)","v":5},{"$f":"VLOOKUP(Coursename,courseinfo,108,FALSE)","v":4},{"$f":"VLOOKUP(Coursename,courseinfo,109,FALSE)","v":4},{"$f":"VLOOKUP(Coursename,courseinfo,110,FALSE)","v":3},{"$f":"VLOOKUP(Coursename,courseinfo,111,FALSE)","v":5},{"$f":"SUM(O7:W7)","v":36},{"$f":"M7+X7","v":72}]
[null,null,null,{"$f":"VLOOKUP(Coursename,courseinfo,4,FALSE)","v":460},{"$f":"VLOOKUP(Coursename,courseinfo,5,FALSE)","v":215},{"$f":"VLOOKUP(Coursename,courseinfo,6,FALSE)","v":442},{"$f":"VLOOKUP(Coursename,courseinfo,7,FALSE)","v":513},{"$f":"VLOOKUP(Coursename,courseinfo,8,FALSE)","v":419},{"$f":"VLOOKUP(Coursename,courseinfo,9,FALSE)","v":199},{"$f":"VLOOKUP(Coursename,courseinfo,10,FALSE)","v":416},{"$f":"VLOOKUP(Coursename,courseinfo,11,FALSE)","v":540},{"$f":"VLOOKUP(Coursename,courseinfo,12,FALSE)","v":346},3550,null,{"$f":"VLOOKUP(Coursename,courseinfo,13,FALSE)","v":419},{"$f":"VLOOKUP(Coursename,courseinfo,14,FALSE)","v":340},{"$f":"VLOOKUP(Coursename,courseinfo,15,FALSE)","v":278},{"$f":"VLOOKUP(Coursename,courseinfo,16,FALSE)","v":214},{"$f":"VLOOKUP(Coursename,courseinfo,17,FALSE)","v":575},{"$f":"VLOOKUP(Coursename,courseinfo,18,FALSE)","v":447},{"$f":"VLOOKUP(Coursename,courseinfo,19,FALSE)","v":430},{"$f":"VLOOKUP(Coursename,courseinfo,20,FALSE)","v":195},{"$f":"VLOOKUP(Coursename,courseinfo,21,FALSE)","v":533},3431,6981]
[null,null,null,{"$f":"VLOOKUP(Coursename,courseinfo,22,FALSE)","v":435},{"$f":"VLOOKUP(Coursename,courseinfo,23,FALSE)","v":185},{"$f":"VLOOKUP(Coursename,courseinfo,24,FALSE)","v":415},{"$f":"VLOOKUP(Coursename,courseinfo,25,FALSE)","v":493},{"$f":"VLOOKUP(Coursename,courseinfo,26,FALSE)","v":400},{"$f":"VLOOKUP(Coursename,courseinfo,27,FALSE)","v":160},{"$f":"VLOOKUP(Coursename,courseinfo,28,FALSE)","v":398},{"$f":"VLOOKUP(Coursename,courseinfo,29,FALSE)","v":520},{"$f":"VLOOKUP(Coursename,courseinfo,30,FALSE)","v":336},3342,null,{"$f":"VLOOKUP(Coursename,courseinfo,31,FALSE)","v":400},{"$f":"VLOOKUP(Coursename,courseinfo,32,FALSE)","v":311},{"$f":"VLOOKUP(Coursename,courseinfo,33,FALSE)","v":270},{"$f":"VLOOKUP(Coursename,courseinfo,34,FALSE)","v":190},{"$f":"VLOOKUP(Coursename,courseinfo,35,FALSE)","v":560},{"$f":"VLOOKUP(Coursename,courseinfo,36,FALSE)","v":413},{"$f":"VLOOKUP(Coursename,courseinfo,37,FALSE)","v":415},{"$f":"VLOOKUP(Coursename,courseinfo,38,FALSE)","v":180},{"$f":"VLOOKUP(Coursename,courseinfo,39,FALSE)","v":513},3252,6594]
[null,null,null,{"$f":"VLOOKUP(Coursename,courseinfo,40,FALSE)","v":423},{"$f":"VLOOKUP(Coursename,courseinfo,41,FALSE)","v":162},{"$f":"VLOOKUP(Coursename,courseinfo,42,FALSE)","v":400},{"$f":"VLOOKUP(Coursename,courseinfo,43,FALSE)","v":459},{"$f":"VLOOKUP(Coursename,courseinfo,44,FALSE)","v":385},{"$f":"VLOOKUP(Coursename,courseinfo,45,FALSE)","v":150},{"$f":"VLOOKUP(Coursename,courseinfo,46,FALSE)","v":380},{"$f":"VLOOKUP(Coursename,courseinfo,47,FALSE)","v":480},{"$f":"VLOOKUP(Coursename,courseinfo,48,FALSE)","v":317},3156,null,{"$f":"VLOOKUP(Coursename,courseinfo,49,FALSE)","v":378},{"$f":"VLOOKUP(Coursename,courseinfo,50,FALSE)","v":285},{"$f":"VLOOKUP(Coursename,courseinfo,51,FALSE)","v":265},{"$f":"VLOOKUP(Coursename,courseinfo,52,FALSE)","v":170},{"$f":"VLOOKUP(Coursename,courseinfo,53,FALSE)","v":546},{"$f":"VLOOKUP(Coursename,courseinfo,54,FALSE)","v":385},{"$f":"VLOOKUP(Coursename,courseinfo,55,FALSE)","v":400},{"$f":"VLOOKUP(Coursename,courseinfo,56,FALSE)","v":160},{"$f":"VLOOKUP(Coursename,courseinfo,57,FALSE)","v":495},3084,6240]
[null,null,null,{"$f":"VLOOKUP(Coursename,courseinfo,58,FALSE)","v":400},{"$f":"VLOOKUP(Coursename,courseinfo,59,FALSE)","v":120},{"$f":"VLOOKUP(Coursename,courseinfo,60,FALSE)","v":373},{"$f":"VLOOKUP(Coursename,courseinfo,61,FALSE)","v":409},{"$f":"VLOOKUP(Coursename,courseinfo,62,FALSE)","v":361},{"$f":"VLOOKUP(Coursename,courseinfo,63,FALSE)","v":126},{"$f":"VLOOKUP(Coursename,courseinfo,64,FALSE)","v":373},{"$f":"VLOOKUP(Coursename,courseinfo,65,FALSE)","v":411},{"$f":"VLOOKUP(Coursename,courseinfo,66,FALSE)","v":279},2852,null,{"$f":"VLOOKUP(Coursename,courseinfo,67,FALSE)","v":353},{"$f":"VLOOKUP(Coursename,courseinfo,68,FALSE)","v":240},{"$f":"VLOOKUP(Coursename,courseinfo,69,FALSE)","v":239},{"$f":"VLOOKUP(Coursename,courseinfo,70,FALSE)","v":155},{"$f":"VLOOKUP(Coursename,courseinfo,71,FALSE)","v":415},{"$f":"VLOOKUP(Coursename,courseinfo,72,FALSE)","v":343},{"$f":"VLOOKUP(Coursename,courseinfo,73,FALSE)","v":370},{"$f":"VLOOKUP(Coursename,courseinfo,74,FALSE)","v":144},{"$f":"VLOOKUP(Coursename,courseinfo,75,FALSE)","v":469},{"$f":"SUM(O11:W11)","v":2728},5580]
[null,null,null,{"$f":"VLOOKUP(Coursename,courseinfo,76,FALSE)","v":340},{"$f":"VLOOKUP(Coursename,courseinfo,77,FALSE)","v":100},{"$f":"VLOOKUP(Coursename,courseinfo,78,FALSE)","v":332},{"$f":"VLOOKUP(Coursename,courseinfo,79,FALSE)","v":380},{"$f":"VLOOKUP(Coursename,courseinfo,80,FALSE)","v":342},{"$f":"VLOOKUP(Coursename,courseinfo,81,FALSE)","v":103},{"$f":"VLOOKUP(Coursename,courseinfo,82,FALSE)","v":332},{"$f":"VLOOKUP(Coursename,courseinfo,83,FALSE)","v":360},{"$f":"VLOOKUP(Coursename,courseinfo,84,FALSE)","v":262},2551,null,{"$f":"VLOOKUP(Coursename,courseinfo,85,FALSE)","v":294},{"$f":"VLOOKUP(Coursename,courseinfo,86,FALSE)","v":200},{"$f":"VLOOKUP(Coursename,courseinfo,87,FALSE)","v":227},{"$f":"VLOOKUP(Coursename,courseinfo,88,FALSE)","v":122},{"$f":"VLOOKUP(Coursename,courseinfo,89,FALSE)","v":400},{"$f":"VLOOKUP(Coursename,courseinfo,90,FALSE)","v":317},{"$f":"VLOOKUP(Coursename,courseinfo,91,FALSE)","v":356},{"$f":"VLOOKUP(Coursename,courseinfo,92,FALSE)","v":123},{"$f":"VLOOKUP(Coursename,courseinfo,93,FALSE)","v":412},2451,5002,null,null,null,null,null,null,null,null,null,null,null,null,null,null,null,null,null,null,null,null,null,null,null,null,null,"RANKINGS & HOLES WON"]
["Taylor",null,null,5,6,4,7,2,6,4,5,6,45,{"$f":"IF(Player1<>\"\",Player1,\"\")","v":"Taylor"},6,4,5,2,3,4,5,6,4,39,84]
["Brandon",null,null,7,6,4,3,2,5,7,6,8,48,{"$f":"IF(Player2 <> \"\", Player2, \"\")","v":"Brandon"},4,5,6,7,8,2,4,5,6,47,95]
["Joe Mama",null,null,2,6,7,7,7,3,4,5,4,45,{"$f":"IF(Player3<>\"\",Player3,\"\")","v":"Joe Mama"},3,3,2,4,5,6,7,6,5,41,86]
["Michael Jordan",null,null,5,3,6,5,4,3,5,4,6,{"$f":"SUM(D16:L16)","v":41},{"$f":"IF(Player4<>\"\", Player4,\"\")","v":"Michael Jordan"},5,4,6,1,3,5,6,4,4,38,{"$f":"M16+X16","v":79}]
["HANDICAP",null,null,{"$f":"VLOOKUP(Coursename,courseinfo,112,FALSE)","v":4},{"$f":"VLOOKUP(Coursename,courseinfo,113,FALSE)","v":8},{"$f":"VLOOKUP(Coursename,courseinfo,114,FALSE)","v":6},{"$f":"VLOOKUP(Coursename,courseinfo,115,FALSE)","v":16},{"$f":"VLOOKUP(Coursename,courseinfo,116,FALSE)","v":2},{"$f":"VLOOKUP(Coursename,courseinfo,117,FALSE)","v":12},{"$f":"VLOOKUP(Coursename,courseinfo,118,FALSE)","v":14},{"$f":"VLOOKUP(Coursename,courseinfo,119,FALSE)","v":10},{"$f":"VLOOKUP(Coursename,courseinfo,120,FALSE)","v":18},null,null,{"$f":"VLOOKUP(Coursename,courseinfo,121,FALSE)","v":9},{"$f":"VLOOKUP(Coursename,courseinfo,122,FALSE)","v":15},{"$f":"VLOOKUP(Coursename,courseinfo,123,FALSE)","v":17},{"$f":"VLOOKUP(Coursename,courseinfo,124,FALSE)","v":7},{"$f":"VLOOKUP(Coursename,courseinfo,125,FALSE)","v":1},{"$f":"VLOOKUP(Coursename,courseinfo,126,FALSE)","v":11},{"$f":"VLOOKUP(Coursename,courseinfo,127,FALSE)","v":5},{"$f":"VLOOKUP(Coursename,courseinfo,128,FALSE)","v":13},{"$f":"VLOOKUP(Coursename,courseinfo,129,FALSE)","v":3}]
[]
[]
[]
[]
[]
[]
[]
["ROUND RESULTS"]
[]
["PLAYER PLACEMENT",null,null,null,"SCORE",null,"COURSE HANDICAP",null,"OVER/UNDER",null,"HOLES WON"]
[1,{"$f":"IF(RANK1<>\"\",OFFSET($A$12,MATCH(A28,ADMIN!$W$11:$W$14,0),0),\"\")","v":"Michael Jordan"},null,null,{"$f":"IF(RANK1<>\"\",OFFSET($Y$12,MATCH(A28,ADMIN!$W$11:$W$14,0),0),\"\")","v":79},null,{"$f":"IF(RANK1<>\"\",OFFSET(ADMIN!$V$10,MATCH(A28,ADMIN!$W$11:$W$14,0),0),\"\")","v":6.0283185840707967},null,{"$f":"IF(First<>\"\",IF($Y$13=$M$13,Score1-$M$7,Score1-$Y$7),\"\")","v":7},null,{"$f":"IF(RANK1<>\"\",OFFSET(ADMIN!$T$10,MATCH(A28,ADMIN!$W$11:$W$14,0),0),\"\")","v":0}]
[2,{"$f":"IF(RANK1<>\"\",OFFSET($A$12,MATCH(A29,ADMIN!$W$11:$W$14,0),0),\"\")","v":"Taylor"},null,null,{"$f":"IF(RANK1<>\"\",OFFSET($Y$12,MATCH(A29,ADMIN!$W$11:$W$14,0),0),\"\")","v":84},null,{"$f":"IF(RANK1<>\"\",OFFSET(ADMIN!$V$10,MATCH(A29,ADMIN!$W$11:$W$14,0),0),\"\")","v":10.78141592920354},null,{"$f":"IF(Second<>\"\",IF($Y$13=$M$13,Score2-$M$7,Score2-$Y$7),\"\")","v":12},null,{"$f":"IF(RANK1<>\"\",OFFSET(ADMIN!$T$10,MATCH(A29,ADMIN!$W$11:$W$14,0),0),\"\")","v":0}]
[3,{"$f":"IF(RANK1<>\"\",OFFSET($A$12,MATCH(A30,ADMIN!$W$11:$W$14,0),0),\"\")","v":"Joe Mama"},null,null,{"$f":"IF(RANK1<>\"\",OFFSET($Y$12,MATCH(A30,ADMIN!$W$11:$W$14,0),0),\"\")","v":86},null,{"$f":"IF(RANK1<>\"\",OFFSET(ADMIN!$V$10,MATCH(A30,ADMIN!$W$11:$W$14,0),0),\"\")","v":15.534513274336284},null,{"$f":"IF(Third<>\"\",IF($Y$13=$M$13,Score3-$M$7,Score3-$Y$7),\"\")","v":14},null,{"$f":"IF(RANK1<>\"\",OFFSET(ADMIN!$T$10,MATCH(A30,ADMIN!$W$11:$W$14,0),0),\"\")","v":4}]
[4,{"$f":"IF(RANK1<>\"\",OFFSET($A$12,MATCH(A31,ADMIN!$W$11:$W$14,0),0),\"\")","v":"Brandon"},null,null,{"$f":"IF(RANK1<>\"\",OFFSET($Y$12,MATCH(A31,ADMIN!$W$11:$W$14,0),0),\"\")","v":95},null,{"$f":"IF(RANK1<>\"\",OFFSET(ADMIN!$V$10,MATCH(A31,ADMIN!$W$11:$W$14,0),0),\"\")","v":22.258407079646016},null,{"$f":"IF(Fourth<>\"\",IF($Y$13=$M$13,Score4-$M$7,Score4-$Y$7),\"\")","v":23},null,{"$f":"IF(RANK1<>\"\",OFFSET(ADMIN!$T$10,MATCH(A31,ADMIN!$W$11:$W$14,0),0),\"\")","v":3}]
[]
[]
[]
[]
[]
[]
[]
[]
[]
[]
[]
[]
[]
[]
[]
[]
[]
[]
[]
[]
[]
[]
[]
[]
[]
[]
[]
[]
[]
[]
[]
[]
[]
[]
[]
[]
[]
[]
[]
[]
[]
[]
[null,5,6,4,7,2,6,4,5,6,null,6,4,5,2,3,4,5,6,4]
[null,7,6,4,3,2,5,7,6,8,null,4,5,6,7,9,2,4,5,6]
[null,2,6,7,8,9,3,4,5,4,null,3,3,2,4,5,6,7,6,5]
[null,5,3,6,5,4,3,5,4,6,null,5,4,6,1,3,5,6,4,4]

{"sheet":"SCORE CENTER","index":2,"n_rows":92,"n_cols":42,"rows_kept":92,"cut":false,"hidden":false,"merged":[[12,1,12,2],[12,3,12,4],[12,5,12,6],[16,25,17,25],[16,0,17,1],[27,0,27,1],[22,0,22,1],[23,0,23,1],[24,0,24,1],[25,0,25,1],[18,0,18,1],[19,0,19,1],[20,0,20,1],[21,0,21,1],[16,18,17,18],[16,19,17,19],[16,20,17,20],[16,21,17,21],[16,12,17,12],[16,13,17,13],[16,14,17,14],[16,15,17,15],[16,16,17,16],[16,24,17,24],[33,0,33,1],[34,0,34,1],[35,0,35,1],[16,22,17,22],[16,23,17,23],[16,2,17,2],[16,3,17,3],[16,4,17,4],[16,5,17,5],[16,6,17,6],[16,7,17,7],[16,8,17,8],[16,9,17,9],[16,10,17,10],[16,11,17,11],[28,0,28,1],[29,0,29,1],[30,0,30,1],[31,0,31,1],[32,0,32,1],[26,0,26,1],[16,17,17,17],[8,1,8,2],[9,1,9,2],[2,1,2,2],[2,3,2,4],[2,5,2,6],[3,1,3,2],[4,1,4,2],[3,5,3,6],[4,5,4,6],[36,0,36,1],[37,0,37,1],[38,0,38,1],[10,5,10,6],[11,5,11,6],[0,1,1,6],[5,5,5,6],[6,5,6,6],[7,5,7,6],[8,5,8,6],[10,1,10,2],[11,1,11,2],[3,3,3,4],[4,3,4,4],[5,3,5,4],[6,3,6,4],[7,3,7,4],[8,3,8,4],[9,3,9,4],[10,3,10,4],[11,3,11,4],[5,1,5,2],[6,1,6,2],[7,1,7,2],[44,0,44,1],[45,0,45,1],[46,0,46,1],[47,0,47,1],[48,0,48,1],[39,0,39,1],[40,0,40,1],[41,0,41,1],[42,0,42,1],[43,0,43,1],[54,0,54,1],[55,0,55,1],[56,0,56,1],[57,0,57,1],[58,0,58,1],[49,0,49,1],[50,0,50,1],[51,0,51,1],[52,0,52,1],[53,0,53,1],[64,0,64,1],[65,0,65,1],[66,0,66,1],[67,0,67,1],[68,0,68,1],[59,0,59,1],[60,0,60,1],[61,0,61,1],[62,0,62,1],[63,0,63,1],[74,0,74,1],[75,0,75,1],[76,0,76,1],[77,0,77,1],[78,0,78,1],[69,0,69,1],[70,0,70,1],[71,0,71,1],[72,0,72,1],[73,0,73,1],[84,0,84,1],[85,0,85,1],[86,0,86,1],[87,0,87,1],[88,0,88,1],[79,0,79,1],[80,0,80,1],[81,0,81,1],[82,0,82,1],[83,0,83,1],[94,0,94,1],[95,0,95,1],[96,0,96,1],[97,0,97,1],[98,0,98,1],[89,0,89,1],[90,0,90,1],[91,0,91,1],[92,0,92,1],[93,0,93,1],[104,0,104,1],[105,0,105,1],[106,0,106,1],[107,0,107,1],[108,0,108,1],[99,0,99,1],[100,0,100,1],[101,0,101,1],[102,0,102,1],[103,0,103,1],[114,0,114,1],[115,0,115,1],[116,0,116,1],[117,0,117,1],[118,0,118,1],[109,0,109,1],[110,0,110,1],[111,0,111,1],[112,0,112,1],[113,0,113,1],[124,0,124,1],[125,0,125,1],[126,0,126,1],[127,0,127,1],[128,0,128,1],[119,0,119,1],[120,0,120,1],[121,0,121,1],[122,0,122,1],[123,0,123,1],[134,0,134,1],[135,0,135,1],[136,0,136,1],[137,0,137,1],[138,0,138,1],[129,0,129,1],[130,0,130,1],[131,0,131,1],[132,0,132,1],[133,0,133,1],[144,0,144,1],[145,0,145,1],[146,0,146,1],[147,0,147,1],[148,0,148,1],[139,0,139,1],[140,0,140,1],[141,0,141,1],[142,0,142,1],[143,0,143,1],[154,0,154,1],[155,0,155,1],[156,0,156,1],[157,0,157,1],[158,0,158,1],[149,0,149,1],[150,0,150,1],[151,0,151,1],[152,0,152,1],[153,0,153,1],[164,0,164,1],[165,0,165,1],[166,0,166,1],[167,0,167,1],[168,0,168,1],[159,0,159,1],[160,0,160,1],[161,0,161,1],[162,0,162,1],[163,0,163,1],[174,0,174,1],[175,0,175,1],[176,0,176,1],[177,0,177,1],[178,0,178,1],[169,0,169,1],[170,0,170,1],[171,0,171,1],[172,0,172,1],[173,0,173,1],[184,0,184,1],[185,0,185,1],[186,0,186,1],[187,0,187,1],[188,0,188,1],[179,0,179,1],[180,0,180,1],[181,0,181,1],[182,0,182,1],[183,0,183,1],[194,0,194,1],[195,0,195,1],[196,0,196,1],[197,0,197,1],[198,0,198,1],[189,0,189,1],[190,0,190,1],[191,0,191,1],[192,0,192,1],[193,0,193,1],[204,0,204,1],[205,0,205,1],[206,0,206,1],[207,0,207,1],[208,0,208,1],[199,0,199,1],[200,0,200,1],[201,0,201,1],[202,0,202,1],[203,0,203,1],[214,0,214,1],[215,0,215,1],[216,0,216,1],[217,0,217,1],[218,0,218,1],[209,0,209,1],[210,0,210,1],[211,0,211,1],[212,0,212,1],[213,0,213,1],[224,0,224,1],[225,0,225,1],[226,0,226,1],[227,0,227,1],[228,0,228,1],[219,0,219,1],[220,0,220,1],[221,0,221,1],[222,0,222,1],[223,0,223,1],[234,0,234,1],[235,0,235,1],[236,0,236,1],[237,0,237,1],[238,0,238,1],[229,0,229,1],[230,0,230,1],[231,0,231,1],[232,0,232,1],[233,0,233,1],[244,0,244,1],[245,0,245,1],[246,0,246,1],[247,0,247,1],[248,0,248,1],[239,0,239,1],[240,0,240,1],[241,0,241,1],[242,0,242,1],[243,0,243,1],[254,0,254,1],[255,0,255,1],[256,0,256,1],[257,0,257,1],[258,0,258,1],[249,0,249,1],[250,0,250,1],[251,0,251,1],[252,0,252,1],[253,0,253,1],[272,0,272,1],[273,0,273,1],[264,0,264,1],[265,0,265,1],[266,0,266,1],[267,0,267,1],[268,0,268,1],[259,0,259,1],[260,0,260,1],[261,0,261,1],[262,0,262,1],[263,0,263,1],[289,0,289,1],[290,0,290,1],[291,0,291,1],[9,5,9,6],[12,7,15,24],[1,10,5,19],[284,0,284,1],[285,0,285,1],[286,0,286,1],[287,0,287,1],[288,0,288,1],[279,0,279,1],[280,0,280,1],[281,0,281,1],[282,0,282,1],[283,0,283,1],[274,0,274,1],[275,0,275,1],[276,0,276,1],[277,0,277,1],[278,0,278,1],[269,0,269,1],[270,0,270,1],[271,0,271,1]]}
[null,"STANDINGS",null,null,null,null,null,null,null,null,null,null,null,null,null,null,null,null,null,null,null,null,null,null,null,null,null,null,null,null,null,null,null,null,null,null,null,null,null,null,"Number of Players: ",{"$f":"COUNTIF(B4:B13,text)","v":0}]
[null,null,null,null,null,null,null,null,null,null,"SCORE CENTER"]
["\\","Player Name",null,"Average Score",null,"Holes Won"]
[1,{"$f":"OFFSET($A$18,MATCH(A4,$Z$19:$Z$66,0),0)","v":"Michael Jordan"},null,{"$f":"OFFSET($W$18,MATCH(A4,$Z$19:$Z$66,0),0)","v":79},null,{"$f":"OFFSET($Y$18,MATCH(A4,$Z$19:$Z$66,0),0)","v":""}]
[2,{"$f":"OFFSET($A$18,MATCH(A5,$Z$19:$Z$66,0),0)","v":"Taylor"},null,{"$f":"OFFSET($W$18,MATCH(A5,$Z$19:$Z$66,0),0)","v":84},null,{"$f":"OFFSET($Y$18,MATCH(A5,$Z$19:$Z$66,0),0)","v":""}]
[3,{"$f":"OFFSET($A$18,MATCH(A6,$Z$19:$Z$66,0),0)","v":"Joe Mama"},null,{"$f":"OFFSET($W$18,MATCH(A6,$Z$19:$Z$66,0),0)","v":86},null,{"$f":"OFFSET($Y$18,MATCH(A6,$Z$19:$Z$66,0),0)","v":5}]
[4,{"$f":"IF(A7<>\"\",OFFSET($A$18,MATCH(A7,$Z$19:$Z$66,0),0),\"\")","v":"Brandon"},null,{"$f":"IF(A7<>\"\",OFFSET($W$18,MATCH(A7,$Z$19:$Z$66,0),0),\"\")","v":95},null,{"$f":"IF(A7<>\"\",OFFSET($Y$18,MATCH(A7,$Z$19:$Z$66,0),0),\"\")","v":3}]
[5,{"$error":"#N/A"},null,{"$error":"#N/A"},null,{"$error":"#N/A"}]
[6,"Posty",null,"",null,""]
[7,"Kramer",null,"",null,""]
[null,"",null,"",null,""]
[null,"",null,"",null,""]
[null,"",null,"",null,"",null,"SCOREBOARD: ALL PLAYERS, HANDICAP AND HOLES WON"]
[]
[]
[]
[null,null,1,2,3,4,5,6,7,8,9,10,11,12,13,14,15,16,17,18,19,20,"Average Score","Handicap Index","Number of Holes Won","Rank"]
[]
["Taylor",null,84,null,null,null,null,null,null,null,null,null,null,null,null,null,null,null,null,null,null,null,{"$f":"IF(C19<> \"\",AVERAGE(C19:V19),\"\")","v":84},{"$f":"ADMIN!Y29","v":9.3000000000000007},{"$f":"ADMIN!Y30","v":""},2]
["Brandon",null,95,null,null,null,null,null,null,null,null,null,null,null,null,null,null,null,null,null,null,null,{"$f":"IF(C20<> \"\",AVERAGE(C20:V20),\"\")","v":95},{"$f":"ADMIN!Y34","v":19.2},{"$f":"ADMIN!Y35","v":3},4]
["Joe Mama",null,86,null,null,null,null,null,null,null,null,null,null,null,null,null,null,null,null,null,null,null,86,{"$f":"ADMIN!Y39","v":13.4},{"$f":"ADMIN!Y40","v":5},3]
["Michael Jordan",null,79,null,null,null,null,null,null,null,null,null,null,null,null,null,null,null,null,null,null,null,79,{"$f":"ADMIN!Y44","v":5.2},{"$f":"ADMIN!Y50","v":""},1]
["Kramer",null,null,null,null,null,null,null,null,null,null,null,null,null,null,null,null,null,null,null,null,null,"",{"$f":"ADMIN!Y49","v":""},{"$f":"ADMIN!Y55","v":""},7]
["Watta Guy",null,null,null,null,null,null,null,null,null,null,null,null,null,null,null,null,null,null,null,null,null,"",{"$f":"ADMIN!Y54","v":""},{"$f":"ADMIN!Y60","v":""},1]
["Posty",null,null,null,null,null,null,null,null,null,null,null,null,null,null,null,null,null,null,null,null,null,"",{"$f":"ADMIN!Y64","v":""},{"$f":"ADMIN!Y65","v":""},6]
[null,null,null,null,null,null,null,null,null,null,null,null,null,null,null,null,null,null,null,null,null,null,"",{"$f":"ADMIN!Y69","v":""},{"$f":"ADMIN!Y90","v":""}]
[null,null,null,null,null,null,null,null,null,null,null,null,null,null,null,null,null,null,null,null,null,null,"",{"$f":"ADMIN!Y94","v":""},{"$f":"ADMIN!Y95","v":""}]
[null,null,null,null,null,null,null,null,null,null,null,null,null,null,null,null,null,null,null,null,null,null,"",{"$f":"ADMIN!Y99","v":""},{"$f":"ADMIN!Y100","v":""}]
[null,null,null,null,null,null,null,null,null,null,null,null,null,null,null,null,null,null,null,null,null,null,"",{"$f":"ADMIN!Y104","v":""},{"$f":"ADMIN!Y105","v":""}]
[null,null,null,null,null,null,null,null,null,null,null,null,null,null,null,null,null,null,null,null,null,null,"",{"$f":"ADMIN!Y109","v":""},{"$f":"ADMIN!Y110","v":""}]
[null,null,null,null,null,null,null,null,null,null,null,null,null,null,null,null,null,null,null,null,null,null,"",{"$f":"ADMIN!Y114","v":""},{"$f":"ADMIN!Y115","v":""}]
[null,null,null,null,null,null,null,null,null,null,null,null,null,null,null,null,null,null,null,null,null,null,"",{"$f":"ADMIN!Y119","v":""},{"$f":"ADMIN!Y120","v":""}]
[null,null,null,null,null,null,null,null,null,null,null,null,null,null,null,null,null,null,null,null,null,null,"",{"$f":"ADMIN!Y124","v":""},{"$f":"ADMIN!Y125","v":""}]
[null,null,null,null,null,null,null,null,null,null,null,null,null,null,null,null,null,null,null,null,null,null,"",{"$f":"ADMIN!Y129","v":""},{"$f":"ADMIN!Y130","v":""}]
[null,null,null,null,null,null,null,null,null,null,null,null,null,null,null,null,null,null,null,null,null,null,"",{"$f":"ADMIN!Y134","v":""},{"$f":"ADMIN!Y135","v":""}]
[null,null,null,null,null,null,null,null,null,null,null,null,null,null,null,null,null,null,null,null,null,null,"",{"$f":"ADMIN!Y139","v":""},{"$f":"ADMIN!Y140","v":""}]
[null,null,null,null,null,null,null,null,null,null,null,null,null,null,null,null,null,null,null,null,null,null,"",{"$f":"ADMIN!Y144","v":""},{"$f":"ADMIN!Y145","v":""}]
[null,null,null,null,null,null,null,null,null,null,null,null,null,null,null,null,null,null,null,null,null,null,"",{"$f":"ADMIN!Y149","v":""},{"$f":"ADMIN!Y150","v":""}]
[null,null,null,null,null,null,null,null,null,null,null,null,null,null,null,null,null,null,null,null,null,null,"",{"$f":"ADMIN!Y154","v":""},{"$f":"ADMIN!Y155","v":""}]
[null,null,null,null,null,null,null,null,null,null,null,null,null,null,null,null,null,null,null,null,null,null,"",{"$f":"ADMIN!Y159","v":""},{"$f":"ADMIN!Y160","v":""}]
[null,null,null,null,null,null,null,null,null,null,null,null,null,null,null,null,null,null,null,null,null,null,"",{"$f":"ADMIN!Y164","v":""},{"$f":"ADMIN!Y165","v":""}]
[null,null,null,null,null,null,null,null,null,null,null,null,null,null,null,null,null,null,null,null,null,null,"",{"$f":"ADMIN!Y169","v":""},{"$f":"ADMIN!Y170","v":""}]
[null,null,null,null,null,null,null,null,null,null,null,null,null,null,null,null,null,null,null,null,null,null,"",{"$f":"ADMIN!Y174","v":""},{"$f":"ADMIN!Y175","v":""}]
[null,null,null,null,null,null,null,null,null,null,null,null,null,null,null,null,null,null,null,null,null,null,"",{"$f":"ADMIN!Y179","v":""},{"$f":"ADMIN!Y180","v":""}]
[null,null,null,null,null,null,null,null,null,null,null,null,null,null,null,null,null,null,null,null,null,null,"",{"$f":"ADMIN!Y184","v":""},{"$f":"ADMIN!Y185","v":""}]
[null,null,null,null,null,null,null,null,null,null,null,null,null,null,null,null,null,null,null,null,null,null,"",{"$f":"ADMIN!Y189","v":""},{"$f":"ADMIN!Y190","v":""}]
[null,null,null,null,null,null,null,null,null,null,null,null,null,null,null,null,null,null,null,null,null,null,"",{"$f":"ADMIN!Y194","v":""},{"$f":"ADMIN!Y195","v":""}]
[null,null,null,null,null,null,null,null,null,null,null,null,null,null,null,null,null,null,null,null,null,null,"",{"$f":"ADMIN!Y199","v":""},{"$f":"ADMIN!Y200","v":""}]
[null,null,null,null,null,null,null,null,null,null,null,null,null,null,null,null,null,null,null,null,null,null,"",{"$f":"ADMIN!Y204","v":""},{"$f":"ADMIN!Y205","v":""}]
[null,null,null,null,null,null,null,null,null,null,null,null,null,null,null,null,null,null,null,null,null,null,"",{"$f":"ADMIN!Y209","v":""},{"$f":"ADMIN!Y210","v":""}]
[null,null,null,null,null,null,null,null,null,null,null,null,null,null,null,null,null,null,null,null,null,null,"",{"$f":"ADMIN!Y213","v":""},{"$f":"ADMIN!Y215","v":""}]
[null,null,null,null,null,null,null,null,null,null,null,null,null,null,null,null,null,null,null,null,null,null,"",{"$f":"ADMIN!Y219","v":""},{"$f":"ADMIN!Y220","v":""}]
[null,null,null,null,null,null,null,null,null,null,null,null,null,null,null,null,null,null,null,null,null,null,"",{"$f":"ADMIN!Y224","v":""},{"$f":"ADMIN!Y225","v":""}]
[null,null,null,null,null,null,null,null,null,null,null,null,null,null,null,null,null,null,null,null,null,null,"",{"$f":"ADMIN!Y229","v":""},{"$f":"ADMIN!Y230","v":""}]
[null,null,null,null,null,null,null,null,null,null,null,null,null,null,null,null,null,null,null,null,null,null,"",{"$f":"ADMIN!Y234","v":""},{"$f":"ADMIN!Y235","v":""}]
[null,null,null,null,null,null,null,null,null,null,null,null,null,null,null,null,null,null,null,null,null,null,"",{"$f":"ADMIN!Y239","v":""},{"$f":"ADMIN!Y240","v":""}]
[null,null,null,null,null,null,null,null,null,null,null,null,null,null,null,null,null,null,null,null,null,null,"",{"$f":"ADMIN!Y244","v":""},{"$f":"ADMIN!Y245","v":""}]
[null,null,null,null,null,null,null,null,null,null,null,null,null,null,null,null,null,null,null,null,null,null,"",{"$f":"ADMIN!Y249","v":""},{"$f":"ADMIN!Y250","v":""}]
[null,null,null,null,null,null,null,null,null,null,null,null,null,null,null,null,null,null,null,null,null,null,"",{"$f":"ADMIN!Y254","v":""},{"$f":"ADMIN!Y255","v":""}]
[null,null,null,null,null,null,null,null,null,null,null,null,null,null,null,null,null,null,null,null,null,null,"",{"$f":"ADMIN!Y259","v":""},{"$f":"ADMIN!Y260","v":""}]
[null,null,null,null,null,null,null,null,null,null,null,null,null,null,null,null,null,null,null,null,null,null,"",{"$f":"ADMIN!Y264","v":""},{"$f":"ADMIN!Y265","v":""}]
[null,null,null,null,null,null,null,null,null,null,null,null,null,null,null,null,null,null,null,null,null,null,"",{"$f":"ADMIN!Y269","v":""},{"$f":"ADMIN!Y270","v":""}]
[null,null,null,null,null,null,null,null,null,null,null,null,null,null,null,null,null,null,null,null,null,null,"",{"$f":"ADMIN!Y274","v":""},{"$f":"ADMIN!Y275","v":""}]
[null,null,null,null,null,null,null,null,null,null,null,null,null,null,null,null,null,null,null,null,null,null,""]
[null,null,null,null,null,null,null,null,null,null,null,null,null,null,null,null,null,null,null,null,null,null,""]
[null,null,null,null,null,null,null,null,null,null,null,null,null,null,null,null,null,null,null,null,null,null,""]
[null,null,null,null,null,null,null,null,null,null,null,null,null,null,null,null,null,null,null,null,null,null,""]
[null,null,null,null,null,null,null,null,null,null,null,null,null,null,null,null,null,null,null,null,null,null,""]
[null,null,null,null,null,null,null,null,null,null,null,null,null,null,null,null,null,null,null,null,null,null,""]
[null,null,null,null,null,null,null,null,null,null,null,null,null,null,null,null,null,null,null,null,null,null,""]
[null,null,null,null,null,null,null,null,null,null,null,null,null,null,null,null,null,null,null,null,null,null,""]
[null,null,null,null,null,null,null,null,null,null,null,null,null,null,null,null,null,null,null,null,null,null,""]
[null,null,null,null,null,null,null,null,null,null,null,null,null,null,null,null,null,null,null,null,null,null,""]
[null,null,null,null,null,null,null,null,null,null,null,null,null,null,null,null,null,null,null,null,null,null,""]
[null,null,null,null,null,null,null,null,null,null,null,null,null,null,null,null,null,null,null,null,null,null,""]
[null,null,null,null,null,null,null,null,null,null,null,null,null,null,null,null,null,null,null,null,null,null,""]
[null,null,null,null,null,null,null,null,null,null,null,null,null,null,null,null,null,null,null,null,null,null,""]
[null,null,null,null,null,null,null,null,null,null,null,null,null,null,null,null,null,null,null,null,null,null,""]
[null,null,null,null,null,null,null,null,null,null,null,null,null,null,null,null,null,null,null,null,null,null,{"$f":"IF(C79<> \"\",AVERAGE(C79:V79),\"\")","v":""}]
[null,null,null,null,null,null,null,null,null,null,null,null,null,null,null,null,null,null,null,null,null,null,""]
[null,null,null,null,null,null,null,null,null,null,null,null,null,null,null,null,null,null,null,null,null,null,""]
[null,null,null,null,null,null,null,null,null,null,null,null,null,null,null,null,null,null,null,null,null,null,""]
[null,null,null,null,null,null,null,null,null,null,null,null,null,null,null,null,null,null,null,null,null,null,""]
[null,null,null,null,null,null,null,null,null,null,null,null,null,null,null,null,null,null,null,null,null,null,""]
[null,null,null,null,null,null,null,null,null,null,null,null,null,null,null,null,null,null,null,null,null,null,""]
[null,null,null,null,null,null,null,null,null,null,null,null,null,null,null,null,null,null,null,null,null,null,""]
[null,null,null,null,null,null,null,null,null,null,null,null,null,null,null,null,null,null,null,null,null,null,""]
[null,null,null,null,null,null,null,null,null,null,null,null,null,null,null,null,null,null,null,null,null,null,""]
[null,null,null,null,null,null,null,null,null,null,null,null,null,null,null,null,null,null,null,null,null,null,""]
[null,null,null,null,null,null,null,null,null,null,null,null,null,null,null,null,null,null,null,null,null,null,""]
[null,null,null,null,null,null,null,null,null,null,null,null,null,null,null,null,null,null,null,null,null,null,""]
[null,null,null,null,null,null,null,null,null,null,null,null,null,null,null,null,null,null,null,null,null,null,""]

{"sheet":"COURSES","index":3,"n_rows":17,"n_cols":129,"rows_kept":17,"cut":false,"hidden":false,"merged":[]}
["Course Name:","Course Rating","Slope",1,2,3,4,5,6,7,8,9,10,11,12,13,14,15,16,17,18,1,2,3,4,5,6,7,8,9,10,11,12,13,14,15,16,17,18,1,2,3,4,5,6,7,8,9,10,11,12,13,14,15,16,17,18,1,2,3,4,5,6,7,8,9,10,11,12,13,14,15,16,17,18,1,2,3,4,5,6,7,8,9,10,11,12,13,14,15,16,17,18,1,2,3,4,5,6,7,8,9,10,11,12,13,14,15,16,17,18,1,2,3,4,5,6,7,8,9,10,11,12,13,14,15,16,17,18]
["The Oaks at Spanish Fork",96.5,110,"-","-","-","-","-","-","-","-","-","-","-","-","-","-","-","-","-","-",384,531,485,210,410,484,460,226,318,527,358,126,326,309,308,444,165,493,340,443,439,181,341,378,385,156,305,512,347,114,279,300,291,405,149,481,319,413,411,141,301,363,361,114,277,448,324,79,255,284,272,378,124,455,"-","-","-","-","-","-","-","-","-","-","-","-","-","-","-","-","-","-",4,5,5,3,4,4,4,3,4,5,4,3,4,4,4,4,3,5,7,3,9,15,11,5,1,17,13,6,8,18,14,12,10,2,16,4]
["Gladstan Golf Course",72.7,131,460,215,442,513,419,199,416,540,346,419,340,278,214,575,447,430,195,533,435,185,415,493,400,160,398,520,336,400,311,270,190,560,413,415,180,513,423,162,400,459,385,150,380,480,317,378,285,265,170,546,385,400,160,495,400,120,373,409,361,126,373,411,279,353,240,239,155,415,343,370,144,469,340,100,332,380,342,103,332,360,262,294,200,227,122,400,317,356,123,412,4,3,4,5,4,3,4,5,4,4,4,4,3,5,4,4,3,5,4,8,6,16,2,12,14,10,18,9,15,17,7,1,11,5,13,3]
["Hobble Creek Golf Course",69.5,123,400,390,495,200,422,190,362,395,520,167,385,380,470,145,400,175,420,490,380,370,472,175,390,165,340,370,495,150,370,365,450,130,385,160,400,480,365,360,450,155,370,145,330,360,480,140,360,360,440,120,375,140,390,470,"-","-","-","-","-","-","-","-","-","-","-","-","-","-","-","-","-","-",315,315,445,110,350,125,310,345,435,130,345,350,430,100,370,120,380,null,4,4,5,3,4,3,4,4,5,3,4,4,5,3,4,3,4,5,5,11,17,9,1,7,15,3,13,14,8,6,18,16,4,10,2,12]
["Eastbay Golf Course",71.8,130,527,423,183,480,380,434,195,452,578,418,175,507,541,206,414,517,139,441,502,410,160,417,351,381,167,416,524,398,163,488,520,193,389,500,123,421,450,372,138,352,328,362,145,391,498,336,140,446,471,168,364,468,105,370,407,331,105,305,294,312,116,346,442,267,105,398,363,156,317,391,90,296,"-","-","-","-","-","-","-","-","-","-","-","-","-","-","-","-","-","-",5,4,3,4,4,4,3,4,5,4,3,5,5,3,4,5,3,4,7,11,15,1,13,9,17,3,5,4,16,8,6,14,12,10,18,2]
["Links at Sleepy Ridge",68.900000000000006,115,419,496,445,187,520,441,213,388,393,413,356,162,541,197,411,459,526,402,378,472,414,164,484,381,188,357,378,370,325,134,478,181,377,418,476,368,352,460,377,150,468,368,175,344,367,341,291,113,468,161,365,406,472,308,281,420,312,128,380,324,162,271,295,302,227,101,360,141,348,363,406,302,null,null,null,null,null,null,null,null,null,null,null,null,null,null,null,null,null,null,4,5,4,3,5,4,3,4,4,4,4,3,5,3,4,4,5,4,3,13,7,17,11,1,5,15,9,4,10,18,14,16,2,8,6,12]
["Fox Hollow Golf Club",73.599999999999994,126,465,563,222,432,365,475,397,164,498,538,423,239,490,187,338,572,379,442,448,522,209,427,351,449,380,155,479,510,405,225,453,173,319,515,365,425,427,491,180,405,316,417,341,141,453,501,386,203,417,158,304,505,354,371,335,474,139,372,290,308,274,134,431,493,356,193,360,144,246,451,300,359,330,454,133,366,280,305,270,128,378,485,350,173,295,136,242,435,295,350,4,5,3,4,4,4,4,3,5,5,4,3,4,3,4,5,4,4,3,5,11,13,15,1,9,17,7,12,14,6,2,18,16,4,8,10]
["Cedar Hills Golf Club",71.7,136,371,356,163,539,200,460,393,148,507,487,120,365,357,304,217,332,371,456,"-","-","-","-","-","-","-","-","-","-","-","-","-","-","-","-","-","-","-","-","-","-","-","-","-","-","-","-","-","-","-","-","-","-","-","-",371,356,163,539,200,460,393,148,507,487,120,365,357,304,189,332,371,456,"-","-","-","-","-","-","-","-","-","-","-","-","-","-","-","-","-","-",4,4,3,5,3,5,4,3,5,5,3,4,4,4,3,4,4,5,15,11,13,3,5,7,1,17,9,12,18,8,4,14,10,16,6,2]
["Thanksgiving Point Golf Club",76.2,140,379,583,325,196,617,495,208,443,476,419,678,436,453,622,218,478,250,440,344,522,288,176,550,426,190,387,430,390,600,394,405,510,194,418,187,385,309,493,268,155,523,397,182,355,396,350,585,372,375,495,166,391,167,365,365,554,308,194,586,460,198,420,460,390,646,420,436,575,194,453,213,435,272,462,247,138,500,371,131,333,352,325,538,345,353,485,139,360,145,342,4,5,4,3,5,4,3,4,4,4,5,4,4,5,3,4,3,4,11,7,13,17,5,1,15,9,3,14,6,12,4,8,18,2,16,10]
["The Ranches Golf Club",73.8,127,566,434,364,435,237,393,505,189,418,438,627,238,529,402,444,209,439,318,539,384,339,410,222,378,454,176,393,390,571,183,510,369,408,186,416,318,502,363,322,349,186,359,432,162,350,370,543,157,482,346,374,158,388,293,466,238,296,303,114,326,408,133,314,344,489,133,426,327,349,133,330,263,null,null,null,null,null,null,null,null,null,null,null,null,null,null,null,null,null,null,5,4,4,4,3,4,5,3,4,4,5,3,5,4,4,3,4,4,3,11,13,1,7,15,5,17,9,8,2,14,10,12,4,18,6,16]
["TalonsCove Golf Club",72.5,127,565,427,375,172,426,262,584,228,550,465,389,387,536,163,591,313,223,440,535,374,349,145,379,223,549,203,515,425,354,353,502,143,553,288,188,420,489,343,306,124,337,187,511,144,485,392,307,320,473,141,506,256,157,396,393,306,271,106,301,158,475,121,459,350,252,268,398,112,435,229,125,369,null,null,null,null,null,null,null,null,null,null,null,null,null,null,null,null,null,null,5,4,4,3,4,3,5,3,5,4,4,4,5,3,5,4,3,4,7,13,15,17,9,3,1,11,5,6,12,14,8,16,2,18,10,4]
["The Ledges Golf Club"]
["Coral Canyon Golf Course"]
["Green Spring Golf Course"]
["City of St. George Golf Course"]
["Dixie Red Hills Golf Course"]
["Sky Mountain Golf Course"]

{"sheet":"ADMIN","index":4,"n_rows":275,"n_cols":25,"rows_kept":275,"cut":false,"hidden":false,"merged":[[9,19,9,20],[10,19,10,20],[11,19,11,20],[12,19,12,20],[13,19,13,20],[9,17,9,18],[1,2,5,13],[1,1,5,1],[10,17,10,18],[11,17,11,18],[12,17,12,18],[13,17,13,18],[9,15,9,16],[10,15,10,16],[11,15,11,16],[12,15,12,16],[13,15,13,16],[10,10,10,11],[11,10,11,11],[12,10,12,11],[7,15,8,23],[9,6,9,7],[10,6,10,7],[11,6,11,7],[35,1,39,1],[45,1,49,1],[260,1,264,1],[265,1,269,1],[270,1,274,1],[235,1,239,1],[240,1,244,1],[245,1,249,1],[250,1,254,1],[255,1,259,1],[210,1,214,1],[215,1,219,1],[220,1,224,1],[225,1,229,1],[230,1,234,1],[185,1,189,1],[190,1,194,1],[195,1,199,1],[200,1,204,1],[205,1,209,1],[160,1,164,1],[165,1,169,1],[170,1,174,1],[175,1,179,1],[180,1,184,1],[135,1,139,1],[140,1,144,1],[145,1,149,1],[150,1,154,1],[155,1,159,1],[110,1,114,1],[115,1,119,1],[120,1,124,1],[125,1,129,1],[130,1,134,1],[100,1,104,1],[105,1,109,1],[50,1,54,1],[60,1,64,1],[65,1,69,1],[70,1,74,1],[75,1,79,1],[80,1,84,1],[55,1,59,1],[16,6,16,7],[17,10,17,11],[25,1,29,1],[30,1,34,1],[40,1,44,1],[18,2,18,3],[19,2,19,3],[9,4,9,5],[10,4,10,5],[11,4,11,5],[12,4,12,5],[13,4,13,5],[9,2,9,3],[10,2,10,3],[11,2,11,3],[12,2,12,3],[13,2,13,3],[14,2,14,3],[21,3,23,24],[21,0,24,2],[25,0,274,0],[85,1,89,1],[90,1,94,1],[95,1,99,1],[14,8,14,9],[15,8,15,9],[16,8,16,9],[17,8,17,9],[18,8,18,9],[18,12,18,13],[10,0,19,0],[17,4,17,5],[18,4,18,5],[19,4,19,5],[15,2,15,3],[16,2,16,3],[17,2,17,3],[17,6,17,7],[18,6,18,7],[19,6,19,7],[19,12,19,13],[12,6,12,7],[13,6,13,7],[14,6,14,7],[14,4,14,5],[15,4,15,5],[16,4,16,5],[15,6,15,7],[7,0,9,1],[19,10,19,11],[9,12,9,13],[10,12,10,13],[11,12,11,13],[12,12,12,13],[13,12,13,13],[14,12,14,13],[15,12,15,13],[16,12,16,13],[17,12,17,13],[13,10,13,11],[14,10,14,11],[15,10,15,11],[19,8,19,9],[7,2,8,13],[9,8,9,9],[10,8,10,9],[11,8,11,9],[12,8,12,9],[13,8,13,9],[9,10,9,11],[16,10,16,11],[18,10,18,11]]}
[]
[null,"NOTES"]
[]
[]
[]
[]
[]
["CUSTOM FUNCTIONS TABLE",null,"INPUTS",null,null,null,null,null,null,null,null,null,null,null,null,"CURRENT COURSE INFORMATION"]
[]
[null,null,"1ST INPUT",null,"2ND INPUT",null,"3RD INPUT",null,"4TH INPUT",null,"5TH INPUT",null,"6TH INPUT",null,null,"PLAYER ROW",null,"SCORE CENTER",null,"HOLES WON",null,"HANDICAP","RANK","RATING"]
["EQUATIONS","HCDIF","SCORE",null,"COURSE RATING",null,"COURSE SLOPE",null,null,null,null,null,null,null,null,26,null,{"$f":"(currentplayer1-26)/5+19","v":19},null,null,null,10.78141592920354,2,72.7]
[null,"HDIND","HANDICAP DIFFERENTIAL",null,null,null,null,null,null,null,null,null,null,null,null,31,null,{"$f":"(currentplayer2-26)/5+19","v":20},null,3,null,22.258407079646016,4,"SLOPE"]
[null,"HDAVG","HANDICAP DIFFERENTIALS",null,"COUNT",null,null,null,null,null,null,null,null,null,null,36,null,{"$f":"(currentplayer3-26)/5+19","v":21},null,4,null,15.534513274336284,3,131]
[null,"CHCAP","HANDICAP INDEX",null,"COURSE SLOPE",null,null,null,null,null,null,null,null,null,null,41,null,{"$f":"(currentplayer4-26)/5+19","v":22},null,null,null,6.0283185840707967,1]
[]
[]
[]
[]
[]
[]
[]
["CALCULATION CENTER",null,null,"LAST 20 ROUNDS"]
[]
[]
[null,null,null,1,2,3,4,5,6,7,8,9,10,11,12,13,14,15,16,17,18,19,20,"RESULTS:"]
["PLAYERS",{"$f":"IF('SCORE CENTER'!A19<>\"\",'SCORE CENTER'!A19,\"\")","v":"Taylor"},"SCORE:",84,null,null,null,null,null,null,null,null,null,null,null,null,null,null,null,null,null,null,null,"COUNT:",{"$f":"COUNT(D26:W26)","v":1}]
[null,null,"RATING:",72.7,null,null,null,null,null,null,null,null,null,null,null,null,null,null,null,null,null,null,null,"-","-"]
[null,null,"SLOPE:",131,null,null,null,null,null,null,null,null,null,null,null,null,null,null,null,null,null,null,null,"HDAVG:",{"$f":"IF(D26<>\"\",Hdavg(D29:W29,Y26),\"\")","v":9.7473282442748062}]
[null,null,"DIFF:",{"$f":"IF(D26<>\"\",HCDIF(D26,D27,D28),\"\")","v":9.7473282442748062},{"$f":"IF(E26<>\"\",HCDIF(E26,E27,E28),\"\")","v":""},"","","","","","","","","","","","","","","","","","","INDEX:",{"$f":"IF(Y28<>\"\",HDIND(Y28),\"\")","v":9.3000000000000007}]
[null,null,"WON:",null,null,null,null,null,null,null,null,null,null,null,null,null,null,null,null,null,null,null,null,"TOTAL:",{"$f":"IF(D30<>\"\",SUM(D30:W30),\"\")","v":""}]
[null,{"$f":"IF('SCORE CENTER'!A20<>\"\",'SCORE CENTER'!A20,\"\")","v":"Brandon"},"SCORE:",96,null,null,null,null,null,null,null,null,null,null,null,null,null,null,null,null,null,null,null,"COUNT:",{"$f":"COUNT(D31:W31)","v":1}]
[null,null,"RATING:",72.7,null,null,null,null,null,null,null,null,null,null,null,null,null,null,null,null,null,null,null,"-","-"]
[null,null,"SLOPE:",131,null,null,null,null,null,null,null,null,null,null,null,null,null,null,null,null,null,null,null,"HDAVG:",{"$f":"IF(D31<>\"\",Hdavg(D34:W34,Y31),\"\")","v":20.098473282442747}]
[null,null,"DIFF:",{"$f":"IF(D31<>\"\",HCDIF(D31,D32,D33),\"\")","v":20.098473282442747},{"$f":"IF(E31<>\"\",HCDIF(E31,E32,E33),\"\")","v":""},{"$f":"IF(F31<>\"\",HCDIF(F31,F32,F33),\"\")","v":""},{"$f":"IF(G31<>\"\",HCDIF(G31,G32,G33),\"\")","v":""},{"$f":"IF(H31<>\"\",HCDIF(H31,H32,H33),\"\")","v":""},{"$f":"IF(I31<>\"\",HCDIF(I31,I32,I33),\"\")","v":""},{"$f":"IF(J31<>\"\",HCDIF(J31,J32,J33),\"\")","v":""},{"$f":"IF(K31<>\"\",HCDIF(K31,K32,K33),\"\")","v":""},{"$f":"IF(L31<>\"\",HCDIF(L31,L32,L33),\"\")","v":""},{"$f":"IF(M31<>\"\",HCDIF(M31,M32,M33),\"\")","v":""},{"$f":"IF(N31<>\"\",HCDIF(N31,N32,N33),\"\")","v":""},{"$f":"IF(O31<>\"\",HCDIF(O31,O32,O33),\"\")","v":""},{"$f":"IF(P31<>\"\",HCDIF(P31,P32,P33),\"\")","v":""},{"$f":"IF(Q31<>\"\",HCDIF(Q31,Q32,Q33),\"\")","v":""},{"$f":"IF(R31<>\"\",HCDIF(R31,R32,R33),\"\")","v":""},{"$f":"IF(S31<>\"\",HCDIF(S31,S32,S33),\"\")","v":""},{"$f":"IF(T31<>\"\",HCDIF(T31,T32,T33),\"\")","v":""},{"$f":"IF(U31<>\"\",HCDIF(U31,U32,U33),\"\")","v":""},{"$f":"IF(V31<>\"\",HCDIF(V31,V32,V33),\"\")","v":""},{"$f":"IF(W31<>\"\",HCDIF(W31,W32,W33),\"\")","v":""},"INDEX:",{"$f":"IF(Y33<>\"\",HDIND(Y33),\"\")","v":19.2}]
[null,null,"WON:",3,null,null,null,null,null,null,null,null,null,null,null,null,null,null,null,null,null,null,null,"TOTAL:",{"$f":"IF(D35<>\"\",SUM(D35:W35),\"\")","v":3}]
[null,{"$f":"IF('SCORE CENTER'!A21<>\"\",'SCORE CENTER'!A21,\"\")","v":"Joe Mama"},"SCORE:",89,null,null,null,null,null,null,null,null,null,null,null,null,null,null,null,null,null,null,null,"COUNT:",{"$f":"COUNT(D36:W36)","v":1}]
[null,null,"RATING:",72.7,null,null,null,null,null,null,null,null,null,null,null,null,null,null,null,null,null,null,null,"-","-"]
[null,null,"SLOPE:",131,null,null,null,null,null,null,null,null,null,null,null,null,null,null,null,null,null,null,null,"HDAVG:",{"$f":"IF(D36<>\"\",Hdavg(D39:W39,Y36),\"\")","v":14.060305343511448}]
[null,null,"DIFF:",{"$f":"IF(D36<>\"\",HCDIF(D36,D37,D38),\"\")","v":14.060305343511448},{"$f":"IF(E36<>\"\",HCDIF(E36,E37,E38),\"\")","v":""},{"$f":"IF(F36<>\"\",HCDIF(F36,F37,F38),\"\")","v":""},{"$f":"IF(G36<>\"\",HCDIF(G36,G37,G38),\"\")","v":""},{"$f":"IF(H36<>\"\",HCDIF(H36,H37,H38),\"\")","v":""},{"$f":"IF(I36<>\"\",HCDIF(I36,I37,I38),\"\")","v":""},{"$f":"IF(J36<>\"\",HCDIF(J36,J37,J38),\"\")","v":""},{"$f":"IF(K36<>\"\",HCDIF(K36,K37,K38),\"\")","v":""},{"$f":"IF(L36<>\"\",HCDIF(L36,L37,L38),\"\")","v":""},{"$f":"IF(M36<>\"\",HCDIF(M36,M37,M38),\"\")","v":""},{"$f":"IF(N36<>\"\",HCDIF(N36,N37,N38),\"\")","v":""},{"$f":"IF(O36<>\"\",HCDIF(O36,O37,O38),\"\")","v":""},{"$f":"IF(P36<>\"\",HCDIF(P36,P37,P38),\"\")","v":""},{"$f":"IF(Q36<>\"\",HCDIF(Q36,Q37,Q38),\"\")","v":""},{"$f":"IF(R36<>\"\",HCDIF(R36,R37,R38),\"\")","v":""},{"$f":"IF(S36<>\"\",HCDIF(S36,S37,S38),\"\")","v":""},{"$f":"IF(T36<>\"\",HCDIF(T36,T37,T38),\"\")","v":""},{"$f":"IF(U36<>\"\",HCDIF(U36,U37,U38),\"\")","v":""},{"$f":"IF(V36<>\"\",HCDIF(V36,V37,V38),\"\")","v":""},{"$f":"IF(W36<>\"\",HCDIF(W36,W37,W38),\"\")","v":""},"INDEX:",{"$f":"IF(Y38<>\"\",HDIND(Y38),\"\")","v":13.4}]
[null,null,"WON:",5,null,null,null,null,null,null,null,null,null,null,null,null,null,null,null,null,null,null,null,"TOTAL:",{"$f":"IF(D40<>\"\",SUM(D40:W40),\"\")","v":5}]
[null,{"$f":"IF('SCORE CENTER'!A22<>\"\",'SCORE CENTER'!A22,\"\")","v":"Michael Jordan"},"SCORE:",79,null,null,null,null,null,null,null,null,null,null,null,null,null,null,null,null,null,null,null,"COUNT:",{"$f":"COUNT(D41:W41)","v":1}]
[null,null,"RATING:",72.7,null,null,null,null,null,null,null,null,null,null,null,null,null,null,null,null,null,null,null,"-","-"]
[null,null,"SLOPE:",131,null,null,null,null,null,null,null,null,null,null,null,null,null,null,null,null,null,null,null,"HDAVG:",{"$f":"IF(D41<>\"\",Hdavg(D44:W44,Y41),\"\")","v":5.4343511450381659}]
[null,null,"DIFF:",{"$f":"IF(D41<>\"\",HCDIF(D41,D42,D43),\"\")","v":5.4343511450381659},{"$f":"IF(E41<>\"\",HCDIF(E41,E42,E43),\"\")","v":""},{"$f":"IF(F41<>\"\",HCDIF(F41,F42,F43),\"\")","v":""},{"$f":"IF(G41<>\"\",HCDIF(G41,G42,G43),\"\")","v":""},{"$f":"IF(H41<>\"\",HCDIF(H41,H42,H43),\"\")","v":""},{"$f":"IF(I41<>\"\",HCDIF(I41,I42,I43),\"\")","v":""},{"$f":"IF(J41<>\"\",HCDIF(J41,J42,J43),\"\")","v":""},{"$f":"IF(K41<>\"\",HCDIF(K41,K42,K43),\"\")","v":""},{"$f":"IF(L41<>\"\",HCDIF(L41,L42,L43),\"\")","v":""},{"$f":"IF(M41<>\"\",HCDIF(M41,M42,M43),\"\")","v":""},{"$f":"IF(N41<>\"\",HCDIF(N41,N42,N43),\"\")","v":""},{"$f":"IF(O41<>\"\",HCDIF(O41,O42,O43),\"\")","v":""},{"$f":"IF(P41<>\"\",HCDIF(P41,P42,P43),\"\")","v":""},{"$f":"IF(Q41<>\"\",HCDIF(Q41,Q42,Q43),\"\")","v":""},{"$f":"IF(R41<>\"\",HCDIF(R41,R42,R43),\"\")","v":""},{"$f":"IF(S41<>\"\",HCDIF(S41,S42,S43),\"\")","v":""},{"$f":"IF(T41<>\"\",HCDIF(T41,T42,T43),\"\")","v":""},{"$f":"IF(U41<>\"\",HCDIF(U41,U42,U43),\"\")","v":""},{"$f":"IF(V41<>\"\",HCDIF(V41,V42,V43),\"\")","v":""},{"$f":"IF(W41<>\"\",HCDIF(W41,W42,W43),\"\")","v":""},"INDEX:",{"$f":"IF(Y43<>\"\",HDIND(Y43),\"\")","v":5.2}]
[null,null,"WON:",4,null,null,null,null,null,null,null,null,null,null,null,null,null,null,null,null,null,null,null,"TOTAL:",{"$f":"IF(D45<>\"\",SUM(D45:W45),\"\")","v":4}]
[null,{"$f":"IF('SCORE CENTER'!A23<>\"\",'SCORE CENTER'!A23,\"\")","v":"Kramer"},"SCORE:",null,null,null,null,null,null,null,null,null,null,null,null,null,null,null,null,null,null,null,null,"COUNT:",{"$f":"COUNT(D46:W46)","v":0}]
[null,null,"RATING:",null,null,null,null,null,null,null,null,null,null,null,null,null,null,null,null,null,null,null,null,"-","-"]
[null,null,"SLOPE:",null,null,null,null,null,null,null,null,null,null,null,null,null,null,null,null,null,null,null,null,"HDAVG:",{"$f":"IF(D46<>\"\",Hdavg(D49:W49,Y46),\"\")","v":""}]
[null,null,"DIFF:",{"$f":"IF(D46<>\"\",HCDIF(D46,D47,D48),\"\")","v":""},{"$f":"IF(E46<>\"\",HCDIF(E46,E47,E48),\"\")","v":""},{"$f":"IF(F46<>\"\",HCDIF(F46,F47,F48),\"\")","v":""},{"$f":"IF(G46<>\"\",HCDIF(G46,G47,G48),\"\")","v":""},{"$f":"IF(H46<>\"\",HCDIF(H46,H47,H48),\"\")","v":""},{"$f":"IF(I46<>\"\",HCDIF(I46,I47,I48),\"\")","v":""},{"$f":"IF(J46<>\"\",HCDIF(J46,J47,J48),\"\")","v":""},{"$f":"IF(K46<>\"\",HCDIF(K46,K47,K48),\"\")","v":""},{"$f":"IF(L46<>\"\",HCDIF(L46,L47,L48),\"\")","v":""},{"$f":"IF(M46<>\"\",HCDIF(M46,M47,M48),\"\")","v":""},{"$f":"IF(N46<>\"\",HCDIF(N46,N47,N48),\"\")","v":""},{"$f":"IF(O46<>\"\",HCDIF(O46,O47,O48),\"\")","v":""},{"$f":"IF(P46<>\"\",HCDIF(P46,P47,P48),\"\")","v":""},{"$f":"IF(Q46<>\"\",HCDIF(Q46,Q47,Q48),\"\")","v":""},{"$f":"IF(R46<>\"\",HCDIF(R46,R47,R48),\"\")","v":""},{"$f":"IF(S46<>\"\",HCDIF(S46,S47,S48),\"\")","v":""},{"$f":"IF(T46<>\"\",HCDIF(T46,T47,T48),\"\")","v":""},{"$f":"IF(U46<>\"\",HCDIF(U46,U47,U48),\"\")","v":""},{"$f":"IF(V46<>\"\",HCDIF(V46,V47,V48),\"\")","v":""},{"$f":"IF(W46<>\"\",HCDIF(W46,W47,W48),\"\")","v":""},"INDEX:",{"$f":"IF(Y48<>\"\",HDIND(Y48),\"\")","v":""}]
[null,null,"WON:",null,null,null,null,null,null,null,null,null,null,null,null,null,null,null,null,null,null,null,null,"TOTAL:",{"$f":"IF(D50<>\"\",SUM(D50:W50),\"\")","v":""}]
[null,{"$f":"IF('SCORE CENTER'!A24<>\"\",'SCORE CENTER'!A24,\"\")","v":"Watta Guy"},"SCORE:",null,null,null,null,null,null,null,null,null,null,null,null,null,null,null,null,null,null,null,null,"COUNT:",{"$f":"COUNT(D51:W51)","v":0}]
[null,null,"RATING:",null,null,null,null,null,null,null,null,null,null,null,null,null,null,null,null,null,null,null,null,"-","-"]
[null,null,"SLOPE:",null,null,null,null,null,null,null,null,null,null,null,null,null,null,null,null,null,null,null,null,"HDAVG:",{"$f":"IF(D51<>\"\",Hdavg(D54:W54,Y51),\"\")","v":""}]
[null,null,"DIFF:",{"$f":"IF(D51<>\"\",HCDIF(D51,D52,D53),\"\")","v":""},{"$f":"IF(E51<>\"\",HCDIF(E51,E52,E53),\"\")","v":""},{"$f":"IF(F51<>\"\",HCDIF(F51,F52,F53),\"\")","v":""},{"$f":"IF(G51<>\"\",HCDIF(G51,G52,G53),\"\")","v":""},{"$f":"IF(H51<>\"\",HCDIF(H51,H52,H53),\"\")","v":""},{"$f":"IF(I51<>\"\",HCDIF(I51,I52,I53),\"\")","v":""},{"$f":"IF(J51<>\"\",HCDIF(J51,J52,J53),\"\")","v":""},{"$f":"IF(K51<>\"\",HCDIF(K51,K52,K53),\"\")","v":""},{"$f":"IF(L51<>\"\",HCDIF(L51,L52,L53),\"\")","v":""},{"$f":"IF(M51<>\"\",HCDIF(M51,M52,M53),\"\")","v":""},{"$f":"IF(N51<>\"\",HCDIF(N51,N52,N53),\"\")","v":""},{"$f":"IF(O51<>\"\",HCDIF(O51,O52,O53),\"\")","v":""},{"$f":"IF(P51<>\"\",HCDIF(P51,P52,P53),\"\")","v":""},{"$f":"IF(Q51<>\"\",HCDIF(Q51,Q52,Q53),\"\")","v":""},{"$f":"IF(R51<>\"\",HCDIF(R51,R52,R53),\"\")","v":""},{"$f":"IF(S51<>\"\",HCDIF(S51,S52,S53),\"\")","v":""},{"$f":"IF(T51<>\"\",HCDIF(T51,T52,T53),\"\")","v":""},{"$f":"IF(U51<>\"\",HCDIF(U51,U52,U53),\"\")","v":""},{"$f":"IF(V51<>\"\",HCDIF(V51,V52,V53),\"\")","v":""},{"$f":"IF(W51<>\"\",HCDIF(W51,W52,W53),\"\")","v":""},"INDEX:",{"$f":"IF(Y53<>\"\",HDIND(Y53),\"\")","v":""}]
[null,null,"WON:",null,null,null,null,null,null,null,null,null,null,null,null,null,null,null,null,null,null,null,null,"TOTAL:",{"$f":"IF(D55<>\"\",SUM(D55:W55),\"\")","v":""}]
[null,{"$f":"IF('SCORE CENTER'!A25<>\"\",'SCORE CENTER'!A25,\"\")","v":"Posty"},"SCORE:",null,null,null,null,null,null,null,null,null,null,null,null,null,null,null,null,null,null,null,null,"COUNT:",{"$f":"COUNT(D56:W56)","v":0}]
[null,null,"RATING:",null,null,null,null,null,null,null,null,null,null,null,null,null,null,null,null,null,null,null,null,"-","-"]
[null,null,"SLOPE:",null,null,null,null,null,null,null,null,null,null,null,null,null,null,null,null,null,null,null,null,"HDAVG:",{"$f":"IF(D56<>\"\",Hdavg(D59:W59,Y56),\"\")","v":""}]
[null,null,"DIFF:",{"$f":"IF(D56<>\"\",HCDIF(D56,D57,D58),\"\")","v":""},{"$f":"IF(E56<>\"\",HCDIF(E56,E57,E58),\"\")","v":""},{"$f":"IF(F56<>\"\",HCDIF(F56,F57,F58),\"\")","v":""},{"$f":"IF(G56<>\"\",HCDIF(G56,G57,G58),\"\")","v":""},{"$f":"IF(H56<>\"\",HCDIF(H56,H57,H58),\"\")","v":""},{"$f":"IF(I56<>\"\",HCDIF(I56,I57,I58),\"\")","v":""},{"$f":"IF(J56<>\"\",HCDIF(J56,J57,J58),\"\")","v":""},{"$f":"IF(K56<>\"\",HCDIF(K56,K57,K58),\"\")","v":""},{"$f":"IF(L56<>\"\",HCDIF(L56,L57,L58),\"\")","v":""},{"$f":"IF(M56<>\"\",HCDIF(M56,M57,M58),\"\")","v":""},{"$f":"IF(N56<>\"\",HCDIF(N56,N57,N58),\"\")","v":""},{"$f":"IF(O56<>\"\",HCDIF(O56,O57,O58),\"\")","v":""},{"$f":"IF(P56<>\"\",HCDIF(P56,P57,P58),\"\")","v":""},{"$f":"IF(Q56<>\"\",HCDIF(Q56,Q57,Q58),\"\")","v":""},{"$f":"IF(R56<>\"\",HCDIF(R56,R57,R58),\"\")","v":""},{"$f":"IF(S56<>\"\",HCDIF(S56,S57,S58),\"\")","v":""},{"$f":"IF(T56<>\"\",HCDIF(T56,T57,T58),\"\")","v":""},{"$f":"IF(U56<>\"\",HCDIF(U56,U57,U58),\"\")","v":""},{"$f":"IF(V56<>\"\",HCDIF(V56,V57,V58),\"\")","v":""},{"$f":"IF(W56<>\"\",HCDIF(W56,W57,W58),\"\")","v":""},"INDEX:",{"$f":"IF(Y58<>\"\",HDIND(Y58),\"\")","v":""}]
[null,null,"WON:",null,null,null,null,null,null,null,null,null,null,null,null,null,null,null,null,null,null,null,null,"TOTAL:",{"$f":"IF(D60<>\"\",SUM(D60:W60),\"\")","v":""}]
[null,{"$f":"IF('SCORE CENTER'!#REF!<>\"\",'SCORE CENTER'!#REF!,\"\")","v":{"$error":"#REF!"}},"SCORE:",null,null,null,null,null,null,null,null,null,null,null,null,null,null,null,null,null,null,null,null,"COUNT:",{"$f":"COUNT(D61:W61)","v":0}]
[null,null,"RATING:",null,null,null,null,null,null,null,null,null,null,null,null,null,null,null,null,null,null,null,null,"-","-"]
[null,null,"SLOPE:",null,null,null,null,null,null,null,null,null,null,null,null,null,null,null,null,null,null,null,null,"HDAVG:",{"$f":"IF(D61<>\"\",Hdavg(D64:W64,Y61),\"\")","v":""}]
[null,null,"DIFF:",{"$f":"IF(D61<>\"\",HCDIF(D61,D62,D63),\"\")","v":""},{"$f":"IF(E61<>\"\",HCDIF(E61,E62,E63),\"\")","v":""},{"$f":"IF(F61<>\"\",HCDIF(F61,F62,F63),\"\")","v":""},{"$f":"IF(G61<>\"\",HCDIF(G61,G62,G63),\"\")","v":""},{"$f":"IF(H61<>\"\",HCDIF(H61,H62,H63),\"\")","v":""},{"$f":"IF(I61<>\"\",HCDIF(I61,I62,I63),\"\")","v":""},{"$f":"IF(J61<>\"\",HCDIF(J61,J62,J63),\"\")","v":""},{"$f":"IF(K61<>\"\",HCDIF(K61,K62,K63),\"\")","v":""},{"$f":"IF(L61<>\"\",HCDIF(L61,L62,L63),\"\")","v":""},{"$f":"IF(M61<>\"\",HCDIF(M61,M62,M63),\"\")","v":""},{"$f":"IF(N61<>\"\",HCDIF(N61,N62,N63),\"\")","v":""},{"$f":"IF(O61<>\"\",HCDIF(O61,O62,O63),\"\")","v":""},{"$f":"IF(P61<>\"\",HCDIF(P61,P62,P63),\"\")","v":""},{"$f":"IF(Q61<>\"\",HCDIF(Q61,Q62,Q63),\"\")","v":""},{"$f":"IF(R61<>\"\",HCDIF(R61,R62,R63),\"\")","v":""},{"$f":"IF(S61<>\"\",HCDIF(S61,S62,S63),\"\")","v":""},{"$f":"IF(T61<>\"\",HCDIF(T61,T62,T63),\"\")","v":""},{"$f":"IF(U61<>\"\",HCDIF(U61,U62,U63),\"\")","v":""},{"$f":"IF(V61<>\"\",HCDIF(V61,V62,V63),\"\")","v":""},{"$f":"IF(W61<>\"\",HCDIF(W61,W62,W63),\"\")","v":""},"INDEX:",{"$f":"IF(Y63<>\"\",HDIND(Y63),\"\")","v":""}]
[null,null,"WON:",null,null,null,null,null,null,null,null,null,null,null,null,null,null,null,null,null,null,null,null,"TOTAL:",{"$f":"IF(D65<>\"\",SUM(D65:W65),\"\")","v":""}]
[null,{"$f":"IF('SCORE CENTER'!A26<>\"\",'SCORE CENTER'!A26,\"\")","v":""},"SCORE:",null,null,null,null,null,null,null,null,null,null,null,null,null,null,null,null,null,null,null,null,"COUNT:",{"$f":"COUNT(D66:W66)","v":0}]
[null,null,"RATING:",null,null,null,null,null,null,null,null,null,null,null,null,null,null,null,null,null,null,null,null,"-","-"]
[null,null,"SLOPE:",null,null,null,null,null,null,null,null,null,null,null,null,null,null,null,null,null,null,null,null,"HDAVG:",{"$f":"IF(D66<>\"\",Hdavg(D69:W69,Y66),\"\")","v":""}]
[null,null,"DIFF:",{"$f":"IF(D66<>\"\",HCDIF(D66,D67,D68),\"\")","v":""},{"$f":"IF(E66<>\"\",HCDIF(E66,E67,E68),\"\")","v":""},{"$f":"IF(F66<>\"\",HCDIF(F66,F67,F68),\"\")","v":""},{"$f":"IF(G66<>\"\",HCDIF(G66,G67,G68),\"\")","v":""},{"$f":"IF(H66<>\"\",HCDIF(H66,H67,H68),\"\")","v":""},{"$f":"IF(I66<>\"\",HCDIF(I66,I67,I68),\"\")","v":""},{"$f":"IF(J66<>\"\",HCDIF(J66,J67,J68),\"\")","v":""},{"$f":"IF(K66<>\"\",HCDIF(K66,K67,K68),\"\")","v":""},{"$f":"IF(L66<>\"\",HCDIF(L66,L67,L68),\"\")","v":""},{"$f":"IF(M66<>\"\",HCDIF(M66,M67,M68),\"\")","v":""},{"$f":"IF(N66<>\"\",HCDIF(N66,N67,N68),\"\")","v":""},{"$f":"IF(O66<>\"\",HCDIF(O66,O67,O68),\"\")","v":""},{"$f":"IF(P66<>\"\",HCDIF(P66,P67,P68),\"\")","v":""},{"$f":"IF(Q66<>\"\",HCDIF(Q66,Q67,Q68),\"\")","v":""},{"$f":"IF(R66<>\"\",HCDIF(R66,R67,R68),\"\")","v":""},{"$f":"IF(S66<>\"\",HCDIF(S66,S67,S68),\"\")","v":""},{"$f":"IF(T66<>\"\",HCDIF(T66,T67,T68),\"\")","v":""},{"$f":"IF(U66<>\"\",HCDIF(U66,U67,U68),\"\")","v":""},{"$f":"IF(V66<>\"\",HCDIF(V66,V67,V68),\"\")","v":""},{"$f":"IF(W66<>\"\",HCDIF(W66,W67,W68),\"\")","v":""},"INDEX:",{"$f":"IF(Y68<>\"\",HDIND(Y68),\"\")","v":""}]
[null,null,"WON:",null,null,null,null,null,null,null,null,null,null,null,null,null,null,null,null,null,null,null,null,"TOTAL:",{"$f":"IF(D70<>\"\",SUM(D70:W70),\"\")","v":""}]
[null,{"$f":"IF('SCORE CENTER'!A27<>\"\",'SCORE CENTER'!A27,\"\")","v":""},"SCORE:",null,null,null,null,null,null,null,null,null,null,null,null,null,null,null,null,null,null,null,null,"COUNT:",{"$f":"COUNT(D71:W71)","v":0}]
[null,null,"RATING:",null,null,null,null,null,null,null,null,null,null,null,null,null,null,null,null,null,null,null,null,"-","-"]
[null,null,"SLOPE:",null,null,null,null,null,null,null,null,null,null,null,null,null,null,null,null,null,null,null,null,"HDAVG:",{"$f":"IF(D71<>\"\",Hdavg(D74:W74,Y71),\"\")","v":""}]
[null,null,"DIFF:",{"$f":"IF(D71<>\"\",HCDIF(D71,D72,D73),\"\")","v":""},{"$f":"IF(E71<>\"\",HCDIF(E71,E72,E73),\"\")","v":""},{"$f":"IF(F71<>\"\",HCDIF(F71,F72,F73),\"\")","v":""},{"$f":"IF(G71<>\"\",HCDIF(G71,G72,G73),\"\")","v":""},{"$f":"IF(H71<>\"\",HCDIF(H71,H72,H73),\"\")","v":""},{"$f":"IF(I71<>\"\",HCDIF(I71,I72,I73),\"\")","v":""},{"$f":"IF(J71<>\"\",HCDIF(J71,J72,J73),\"\")","v":""},{"$f":"IF(K71<>\"\",HCDIF(K71,K72,K73),\"\")","v":""},{"$f":"IF(L71<>\"\",HCDIF(L71,L72,L73),\"\")","v":""},{"$f":"IF(M71<>\"\",HCDIF(M71,M72,M73),\"\")","v":""},{"$f":"IF(N71<>\"\",HCDIF(N71,N72,N73),\"\")","v":""},{"$f":"IF(O71<>\"\",HCDIF(O71,O72,O73),\"\")","v":""},{"$f":"IF(P71<>\"\",HCDIF(P71,P72,P73),\"\")","v":""},{"$f":"IF(Q71<>\"\",HCDIF(Q71,Q72,Q73),\"\")","v":""},{"$f":"IF(R71<>\"\",HCDIF(R71,R72,R73),\"\")","v":""},{"$f":"IF(S71<>\"\",HCDIF(S71,S72,S73),\"\")","v":""},{"$f":"IF(T71<>\"\",HCDIF(T71,T72,T73),\"\")","v":""},{"$f":"IF(U71<>\"\",HCDIF(U71,U72,U73),\"\")","v":""},{"$f":"IF(V71<>\"\",HCDIF(V71,V72,V73),\"\")","v":""},{"$f":"IF(W71<>\"\",HCDIF(W71,W72,W73),\"\")","v":""},"INDEX:",{"$f":"IF(Y73<>\"\",HDIND(Y73),\"\")","v":""}]
[null,null,"WON:",null,null,null,null,null,null,null,null,null,null,null,null,null,null,null,null,null,null,null,null,"TOTAL:",{"$f":"IF(D75<>\"\",SUM(D75:W75),\"\")","v":""}]
[null,{"$f":"IF('SCORE CENTER'!A28<>\"\",'SCORE CENTER'!A28,\"\")","v":""},"SCORE:",null,null,null,null,null,null,null,null,null,null,null,null,null,null,null,null,null,null,null,null,"COUNT:",{"$f":"COUNT(D76:W76)","v":0}]
[null,null,"RATING:",null,null,null,null,null,null,null,null,null,null,null,null,null,null,null,null,null,null,null,null,"-","-"]
[null,null,"SLOPE:",null,null,null,null,null,null,null,null,null,null,null,null,null,null,null,null,null,null,null,null,"HDAVG:",{"$f":"IF(D76<>\"\",Hdavg(D79:W79,Y76),\"\")","v":""}]
[null,null,"DIFF:",{"$f":"IF(D76<>\"\",HCDIF(D76,D77,D78),\"\")","v":""},{"$f":"IF(E76<>\"\",HCDIF(E76,E77,E78),\"\")","v":""},{"$f":"IF(F76<>\"\",HCDIF(F76,F77,F78),\"\")","v":""},{"$f":"IF(G76<>\"\",HCDIF(G76,G77,G78),\"\")","v":""},{"$f":"IF(H76<>\"\",HCDIF(H76,H77,H78),\"\")","v":""},{"$f":"IF(I76<>\"\",HCDIF(I76,I77,I78),\"\")","v":""},{"$f":"IF(J76<>\"\",HCDIF(J76,J77,J78),\"\")","v":""},{"$f":"IF(K76<>\"\",HCDIF(K76,K77,K78),\"\")","v":""},{"$f":"IF(L76<>\"\",HCDIF(L76,L77,L78),\"\")","v":""},{"$f":"IF(M76<>\"\",HCDIF(M76,M77,M78),\"\")","v":""},{"$f":"IF(N76<>\"\",HCDIF(N76,N77,N78),\"\")","v":""},{"$f":"IF(O76<>\"\",HCDIF(O76,O77,O78),\"\")","v":""},{"$f":"IF(P76<>\"\",HCDIF(P76,P77,P78),\"\")","v":""},{"$f":"IF(Q76<>\"\",HCDIF(Q76,Q77,Q78),\"\")","v":""},{"$f":"IF(R76<>\"\",HCDIF(R76,R77,R78),\"\")","v":""},{"$f":"IF(S76<>\"\",HCDIF(S76,S77,S78),\"\")","v":""},{"$f":"IF(T76<>\"\",HCDIF(T76,T77,T78),\"\")","v":""},{"$f":"IF(U76<>\"\",HCDIF(U76,U77,U78),\"\")","v":""},{"$f":"IF(V76<>\"\",HCDIF(V76,V77,V78),\"\")","v":""},{"$f":"IF(W76<>\"\",HCDIF(W76,W77,W78),\"\")","v":""},"INDEX:",{"$f":"IF(Y78<>\"\",HDIND(Y78),\"\")","v":""}]
[null,null,"WON:",null,null,null,null,null,null,null,null,null,null,null,null,null,null,null,null,null,null,null,null,"TOTAL:",{"$f":"IF(D80<>\"\",SUM(D80:W80),\"\")","v":""}]
[null,{"$f":"IF('SCORE CENTER'!A29<>\"\",'SCORE CENTER'!A29,\"\")","v":""},"SCORE:",null,null,null,null,null,null,null,null,null,null,null,null,null,null,null,null,null,null,null,null,"COUNT:",{"$f":"COUNT(D81:W81)","v":0}]
[null,null,"RATING:",null,null,null,null,null,null,null,null,null,null,null,null,null,null,null,null,null,null,null,null,"-","-"]
[null,null,"SLOPE:",null,null,null,null,null,null,null,null,null,null,null,null,null,null,null,null,null,null,null,null,"HDAVG:",{"$f":"IF(D81<>\"\",Hdavg(D84:W84,Y81),\"\")","v":""}]
[null,null,"DIFF:",{"$f":"IF(D81<>\"\",HCDIF(D81,D82,D83),\"\")","v":""},{"$f":"IF(E81<>\"\",HCDIF(E81,E82,E83),\"\")","v":""},{"$f":"IF(F81<>\"\",HCDIF(F81,F82,F83),\"\")","v":""},{"$f":"IF(G81<>\"\",HCDIF(G81,G82,G83),\"\")","v":""},{"$f":"IF(H81<>\"\",HCDIF(H81,H82,H83),\"\")","v":""},{"$f":"IF(I81<>\"\",HCDIF(I81,I82,I83),\"\")","v":""},{"$f":"IF(J81<>\"\",HCDIF(J81,J82,J83),\"\")","v":""},{"$f":"IF(K81<>\"\",HCDIF(K81,K82,K83),\"\")","v":""},{"$f":"IF(L81<>\"\",HCDIF(L81,L82,L83),\"\")","v":""},{"$f":"IF(M81<>\"\",HCDIF(M81,M82,M83),\"\")","v":""},{"$f":"IF(N81<>\"\",HCDIF(N81,N82,N83),\"\")","v":""},{"$f":"IF(O81<>\"\",HCDIF(O81,O82,O83),\"\")","v":""},{"$f":"IF(P81<>\"\",HCDIF(P81,P82,P83),\"\")","v":""},{"$f":"IF(Q81<>\"\",HCDIF(Q81,Q82,Q83),\"\")","v":""},{"$f":"IF(R81<>\"\",HCDIF(R81,R82,R83),\"\")","v":""},{"$f":"IF(S81<>\"\",HCDIF(S81,S82,S83),\"\")","v":""},{"$f":"IF(T81<>\"\",HCDIF(T81,T82,T83),\"\")","v":""},{"$f":"IF(U81<>\"\",HCDIF(U81,U82,U83),\"\")","v":""},{"$f":"IF(V81<>\"\",HCDIF(V81,V82,V83),\"\")","v":""},{"$f":"IF(W81<>\"\",HCDIF(W81,W82,W83),\"\")","v":""},"INDEX:",{"$f":"IF(Y83<>\"\",HDIND(Y83),\"\")","v":""}]
[null,null,"WON:",null,null,null,null,null,null,null,null,null,null,null,null,null,null,null,null,null,null,null,null,"TOTAL:",{"$f":"IF(D85<>\"\",SUM(D85:W85),\"\")","v":""}]
[null,{"$f":"IF('SCORE CENTER'!A30<>\"\",'SCORE CENTER'!A30,\"\")","v":""},"SCORE:",null,null,null,null,null,null,null,null,null,null,null,null,null,null,null,null,null,null,null,null,"COUNT:",{"$f":"COUNT(D86:W86)","v":0}]
[null,null,"RATING:",null,null,null,null,null,null,null,null,null,null,null,null,null,null,null,null,null,null,null,null,"-","-"]
[null,null,"SLOPE:",null,null,null,null,null,null,null,null,null,null,null,null,null,null,null,null,null,null,null,null,"HDAVG:",{"$f":"IF(D86<>\"\",Hdavg(D89:W89,Y86),\"\")","v":""}]
[null,null,"DIFF:",{"$f":"IF(D86<>\"\",HCDIF(D86,D87,D88),\"\")","v":""},{"$f":"IF(E86<>\"\",HCDIF(E86,E87,E88),\"\")","v":""},{"$f":"IF(F86<>\"\",HCDIF(F86,F87,F88),\"\")","v":""},{"$f":"IF(G86<>\"\",HCDIF(G86,G87,G88),\"\")","v":""},{"$f":"IF(H86<>\"\",HCDIF(H86,H87,H88),\"\")","v":""},{"$f":"IF(I86<>\"\",HCDIF(I86,I87,I88),\"\")","v":""},{"$f":"IF(J86<>\"\",HCDIF(J86,J87,J88),\"\")","v":""},{"$f":"IF(K86<>\"\",HCDIF(K86,K87,K88),\"\")","v":""},{"$f":"IF(L86<>\"\",HCDIF(L86,L87,L88),\"\")","v":""},{"$f":"IF(M86<>\"\",HCDIF(M86,M87,M88),\"\")","v":""},{"$f":"IF(N86<>\"\",HCDIF(N86,N87,N88),\"\")","v":""},{"$f":"IF(O86<>\"\",HCDIF(O86,O87,O88),\"\")","v":""},{"$f":"IF(P86<>\"\",HCDIF(P86,P87,P88),\"\")","v":""},{"$f":"IF(Q86<>\"\",HCDIF(Q86,Q87,Q88),\"\")","v":""},{"$f":"IF(R86<>\"\",HCDIF(R86,R87,R88),\"\")","v":""},{"$f":"IF(S86<>\"\",HCDIF(S86,S87,S88),\"\")","v":""},{"$f":"IF(T86<>\"\",HCDIF(T86,T87,T88),\"\")","v":""},{"$f":"IF(U86<>\"\",HCDIF(U86,U87,U88),\"\")","v":""},{"$f":"IF(V86<>\"\",HCDIF(V86,V87,V88),\"\")","v":""},{"$f":"IF(W86<>\"\",HCDIF(W86,W87,W88),\"\")","v":""},"INDEX:",{"$f":"IF(Y88<>\"\",HDIND(Y88),\"\")","v":""}]
[null,null,"WON:",null,null,null,null,null,null,null,null,null,null,null,null,null,null,null,null,null,null,null,null,"TOTAL:",{"$f":"IF(D90<>\"\",SUM(D90:W90),\"\")","v":""}]
[null,{"$f":"IF('SCORE CENTER'!A31<>\"\",'SCORE CENTER'!A31,\"\")","v":""},"SCORE:",null,null,null,null,null,null,null,null,null,null,null,null,null,null,null,null,null,null,null,null,"COUNT:",{"$f":"COUNT(D91:W91)","v":0}]
[null,null,"RATING:",null,null,null,null,null,null,null,null,null,null,null,null,null,null,null,null,null,null,null,null,"-","-"]
[null,null,"SLOPE:",null,null,null,null,null,null,null,null,null,null,null,null,null,null,null,null,null,null,null,null,"HDAVG:",{"$f":"IF(D91<>\"\",Hdavg(D94:W94,Y91),\"\")","v":""}]
[null,null,"DIFF:",{"$f":"IF(D91<>\"\",HCDIF(D91,D92,D93),\"\")","v":""},{"$f":"IF(E91<>\"\",HCDIF(E91,E92,E93),\"\")","v":""},{"$f":"IF(F91<>\"\",HCDIF(F91,F92,F93),\"\")","v":""},{"$f":"IF(G91<>\"\",HCDIF(G91,G92,G93),\"\")","v":""},{"$f":"IF(H91<>\"\",HCDIF(H91,H92,H93),\"\")","v":""},{"$f":"IF(I91<>\"\",HCDIF(I91,I92,I93),\"\")","v":""},{"$f":"IF(J91<>\"\",HCDIF(J91,J92,J93),\"\")","v":""},{"$f":"IF(K91<>\"\",HCDIF(K91,K92,K93),\"\")","v":""},{"$f":"IF(L91<>\"\",HCDIF(L91,L92,L93),\"\")","v":""},{"$f":"IF(M91<>\"\",HCDIF(M91,M92,M93),\"\")","v":""},{"$f":"IF(N91<>\"\",HCDIF(N91,N92,N93),\"\")","v":""},{"$f":"IF(O91<>\"\",HCDIF(O91,O92,O93),\"\")","v":""},{"$f":"IF(P91<>\"\",HCDIF(P91,P92,P93),\"\")","v":""},{"$f":"IF(Q91<>\"\",HCDIF(Q91,Q92,Q93),\"\")","v":""},{"$f":"IF(R91<>\"\",HCDIF(R91,R92,R93),\"\")","v":""},{"$f":"IF(S91<>\"\",HCDIF(S91,S92,S93),\"\")","v":""},{"$f":"IF(T91<>\"\",HCDIF(T91,T92,T93),\"\")","v":""},{"$f":"IF(U91<>\"\",HCDIF(U91,U92,U93),\"\")","v":""},{"$f":"IF(V91<>\"\",HCDIF(V91,V92,V93),\"\")","v":""},{"$f":"IF(W91<>\"\",HCDIF(W91,W92,W93),\"\")","v":""},"INDEX:",{"$f":"IF(Y93<>\"\",HDIND(Y93),\"\")","v":""}]
[null,null,"WON:",null,null,null,null,null,null,null,null,null,null,null,null,null,null,null,null,null,null,null,null,"TOTAL:",{"$f":"IF(D95<>\"\",SUM(D95:W95),\"\")","v":""}]
[null,{"$f":"IF('SCORE CENTER'!A32<>\"\",'SCORE CENTER'!A32,\"\")","v":""},"SCORE:",null,null,null,null,null,null,null,null,null,null,null,null,null,null,null,null,null,null,null,null,"COUNT:",{"$f":"COUNT(D96:W96)","v":0}]
[null,null,"RATING:",null,null,null,null,null,null,null,null,null,null,null,null,null,null,null,null,null,null,null,null,"-","-"]
[null,null,"SLOPE:",null,null,null,null,null,null,null,null,null,null,null,null,null,null,null,null,null,null,null,null,"HDAVG:",{"$f":"IF(D96<>\"\",Hdavg(D99:W99,Y96),\"\")","v":""}]
[null,null,"DIFF:",{"$f":"IF(D96<>\"\",HCDIF(D96,D97,D98),\"\")","v":""},{"$f":"IF(E96<>\"\",HCDIF(E96,E97,E98),\"\")","v":""},{"$f":"IF(F96<>\"\",HCDIF(F96,F97,F98),\"\")","v":""},{"$f":"IF(G96<>\"\",HCDIF(G96,G97,G98),\"\")","v":""},{"$f":"IF(H96<>\"\",HCDIF(H96,H97,H98),\"\")","v":""},{"$f":"IF(I96<>\"\",HCDIF(I96,I97,I98),\"\")","v":""},{"$f":"IF(J96<>\"\",HCDIF(J96,J97,J98),\"\")","v":""},{"$f":"IF(K96<>\"\",HCDIF(K96,K97,K98),\"\")","v":""},{"$f":"IF(L96<>\"\",HCDIF(L96,L97,L98),\"\")","v":""},{"$f":"IF(M96<>\"\",HCDIF(M96,M97,M98),\"\")","v":""},{"$f":"IF(N96<>\"\",HCDIF(N96,N97,N98),\"\")","v":""},{"$f":"IF(O96<>\"\",HCDIF(O96,O97,O98),\"\")","v":""},{"$f":"IF(P96<>\"\",HCDIF(P96,P97,P98),\"\")","v":""},{"$f":"IF(Q96<>\"\",HCDIF(Q96,Q97,Q98),\"\")","v":""},{"$f":"IF(R96<>\"\",HCDIF(R96,R97,R98),\"\")","v":""},{"$f":"IF(S96<>\"\",HCDIF(S96,S97,S98),\"\")","v":""},{"$f":"IF(T96<>\"\",HCDIF(T96,T97,T98),\"\")","v":""},{"$f":"IF(U96<>\"\",HCDIF(U96,U97,U98),\"\")","v":""},{"$f":"IF(V96<>\"\",HCDIF(V96,V97,V98),\"\")","v":""},{"$f":"IF(W96<>\"\",HCDIF(W96,W97,W98),\"\")","v":""},"INDEX:",{"$f":"IF(Y98<>\"\",HDIND(Y98),\"\")","v":""}]
[null,null,"WON:",null,null,null,null,null,null,null,null,null,null,null,null,null,null,null,null,null,null,null,null,"TOTAL:",{"$f":"IF(D100<>\"\",SUM(D100:W100),\"\")","v":""}]
[null,{"$f":"IF('SCORE CENTER'!A33<>\"\",'SCORE CENTER'!A33,\"\")","v":""},"SCORE:",null,null,null,null,null,null,null,null,null,null,null,null,null,null,null,null,null,null,null,null,"COUNT:",{"$f":"COUNT(D101:W101)","v":0}]
[null,null,"RATING:",null,null,null,null,null,null,null,null,null,null,null,null,null,null,null,null,null,null,null,null,"-","-"]
[null,null,"SLOPE:",null,null,null,null,null,null,null,null,null,null,null,null,null,null,null,null,null,null,null,null,"HDAVG:",{"$f":"IF(D101<>\"\",Hdavg(D104:W104,Y101),\"\")","v":""}]
[null,null,"DIFF:",{"$f":"IF(D101<>\"\",HCDIF(D101,D102,D103),\"\")","v":""},{"$f":"IF(E101<>\"\",HCDIF(E101,E102,E103),\"\")","v":""},{"$f":"IF(F101<>\"\",HCDIF(F101,F102,F103),\"\")","v":""},{"$f":"IF(G101<>\"\",HCDIF(G101,G102,G103),\"\")","v":""},{"$f":"IF(H101<>\"\",HCDIF(H101,H102,H103),\"\")","v":""},{"$f":"IF(I101<>\"\",HCDIF(I101,I102,I103),\"\")","v":""},{"$f":"IF(J101<>\"\",HCDIF(J101,J102,J103),\"\")","v":""},{"$f":"IF(K101<>\"\",HCDIF(K101,K102,K103),\"\")","v":""},{"$f":"IF(L101<>\"\",HCDIF(L101,L102,L103),\"\")","v":""},{"$f":"IF(M101<>\"\",HCDIF(M101,M102,M103),\"\")","v":""},{"$f":"IF(N101<>\"\",HCDIF(N101,N102,N103),\"\")","v":""},{"$f":"IF(O101<>\"\",HCDIF(O101,O102,O103),\"\")","v":""},{"$f":"IF(P101<>\"\",HCDIF(P101,P102,P103),\"\")","v":""},{"$f":"IF(Q101<>\"\",HCDIF(Q101,Q102,Q103),\"\")","v":""},{"$f":"IF(R101<>\"\",HCDIF(R101,R102,R103),\"\")","v":""},{"$f":"IF(S101<>\"\",HCDIF(S101,S102,S103),\"\")","v":""},{"$f":"IF(T101<>\"\",HCDIF(T101,T102,T103),\"\")","v":""},{"$f":"IF(U101<>\"\",HCDIF(U101,U102,U103),\"\")","v":""},{"$f":"IF(V101<>\"\",HCDIF(V101,V102,V103),\"\")","v":""},{"$f":"IF(W101<>\"\",HCDIF(W101,W102,W103),\"\")","v":""},"INDEX:",{"$f":"IF(Y103<>\"\",HDIND(Y103),\"\")","v":""}]
[null,null,"WON:",null,null,null,null,null,null,null,null,null,null,null,null,null,null,null,null,null,null,null,null,"TOTAL:",{"$f":"IF(D105<>\"\",SUM(D105:W105),\"\")","v":""}]
[null,{"$f":"IF('SCORE CENTER'!A34<>\"\",'SCORE CENTER'!A34,\"\")","v":""},"SCORE:",null,null,null,null,null,null,null,null,null,null,null,null,null,null,null,null,null,null,null,null,"COUNT:",{"$f":"COUNT(D106:W106)","v":0}]
[null,null,"RATING:",null,null,null,null,null,null,null,null,null,null,null,null,null,null,null,null,null,null,null,null,"-","-"]
[null,null,"SLOPE:",null,null,null,null,null,null,null,null,null,null,null,null,null,null,null,null,null,null,null,null,"HDAVG:",{"$f":"IF(D106<>\"\",Hdavg(D109:W109,Y106),\"\")","v":""}]
[null,null,"DIFF:",{"$f":"IF(D106<>\"\",HCDIF(D106,D107,D108),\"\")","v":""},{"$f":"IF(E106<>\"\",HCDIF(E106,E107,E108),\"\")","v":""},{"$f":"IF(F106<>\"\",HCDIF(F106,F107,F108),\"\")","v":""},{"$f":"IF(G106<>\"\",HCDIF(G106,G107,G108),\"\")","v":""},{"$f":"IF(H106<>\"\",HCDIF(H106,H107,H108),\"\")","v":""},{"$f":"IF(I106<>\"\",HCDIF(I106,I107,I108),\"\")","v":""},{"$f":"IF(J106<>\"\",HCDIF(J106,J107,J108),\"\")","v":""},{"$f":"IF(K106<>\"\",HCDIF(K106,K107,K108),\"\")","v":""},{"$f":"IF(L106<>\"\",HCDIF(L106,L107,L108),\"\")","v":""},{"$f":"IF(M106<>\"\",HCDIF(M106,M107,M108),\"\")","v":""},{"$f":"IF(N106<>\"\",HCDIF(N106,N107,N108),\"\")","v":""},{"$f":"IF(O106<>\"\",HCDIF(O106,O107,O108),\"\")","v":""},{"$f":"IF(P106<>\"\",HCDIF(P106,P107,P108),\"\")","v":""},{"$f":"IF(Q106<>\"\",HCDIF(Q106,Q107,Q108),\"\")","v":""},{"$f":"IF(R106<>\"\",HCDIF(R106,R107,R108),\"\")","v":""},{"$f":"IF(S106<>\"\",HCDIF(S106,S107,S108),\"\")","v":""},{"$f":"IF(T106<>\"\",HCDIF(T106,T107,T108),\"\")","v":""},{"$f":"IF(U106<>\"\",HCDIF(U106,U107,U108),\"\")","v":""},{"$f":"IF(V106<>\"\",HCDIF(V106,V107,V108),\"\")","v":""},{"$f":"IF(W106<>\"\",HCDIF(W106,W107,W108),\"\")","v":""},"INDEX:",{"$f":"IF(Y108<>\"\",HDIND(Y108),\"\")","v":""}]
[null,null,"WON:",null,null,null,null,null,null,null,null,null,null,null,null,null,null,null,null,null,null,null,null,"TOTAL:",{"$f":"IF(D110<>\"\",SUM(D110:W110),\"\")","v":""}]
[null,{"$f":"IF('SCORE CENTER'!A35<>\"\",'SCORE CENTER'!A35,\"\")","v":""},"SCORE:",null,null,null,null,null,null,null,null,null,null,null,null,null,null,null,null,null,null,null,null,"COUNT:",{"$f":"COUNT(D111:W111)","v":0}]
[null,null,"RATING:",null,null,null,null,null,null,null,null,null,null,null,null,null,null,null,null,null,null,null,null,"-","-"]
[null,null,"SLOPE:",null,null,null,null,null,null,null,null,null,null,null,null,null,null,null,null,null,null,null,null,"HDAVG:",{"$f":"IF(D111<>\"\",Hdavg(D114:W114,Y111),\"\")","v":""}]
[null,null,"DIFF:",{"$f":"IF(D111<>\"\",HCDIF(D111,D112,D113),\"\")","v":""},{"$f":"IF(E111<>\"\",HCDIF(E111,E112,E113),\"\")","v":""},{"$f":"IF(F111<>\"\",HCDIF(F111,F112,F113),\"\")","v":""},{"$f":"IF(G111<>\"\",HCDIF(G111,G112,G113),\"\")","v":""},{"$f":"IF(H111<>\"\",HCDIF(H111,H112,H113),\"\")","v":""},{"$f":"IF(I111<>\"\",HCDIF(I111,I112,I113),\"\")","v":""},{"$f":"IF(J111<>\"\",HCDIF(J111,J112,J113),\"\")","v":""},{"$f":"IF(K111<>\"\",HCDIF(K111,K112,K113),\"\")","v":""},{"$f":"IF(L111<>\"\",HCDIF(L111,L112,L113),\"\")","v":""},{"$f":"IF(M111<>\"\",HCDIF(M111,M112,M113),\"\")","v":""},{"$f":"IF(N111<>\"\",HCDIF(N111,N112,N113),\"\")","v":""},{"$f":"IF(O111<>\"\",HCDIF(O111,O112,O113),\"\")","v":""},{"$f":"IF(P111<>\"\",HCDIF(P111,P112,P113),\"\")","v":""},{"$f":"IF(Q111<>\"\",HCDIF(Q111,Q112,Q113),\"\")","v":""},{"$f":"IF(R111<>\"\",HCDIF(R111,R112,R113),\"\")","v":""},{"$f":"IF(S111<>\"\",HCDIF(S111,S112,S113),\"\")","v":""},{"$f":"IF(T111<>\"\",HCDIF(T111,T112,T113),\"\")","v":""},{"$f":"IF(U111<>\"\",HCDIF(U111,U112,U113),\"\")","v":""},{"$f":"IF(V111<>\"\",HCDIF(V111,V112,V113),\"\")","v":""},{"$f":"IF(W111<>\"\",HCDIF(W111,W112,W113),\"\")","v":""},"INDEX:",{"$f":"IF(Y113<>\"\",HDIND(Y113),\"\")","v":""}]
[null,null,"WON:",null,null,null,null,null,null,null,null,null,null,null,null,null,null,null,null,null,null,null,null,"TOTAL:",{"$f":"IF(D115<>\"\",SUM(D115:W115),\"\")","v":""}]
[null,{"$f":"IF('SCORE CENTER'!A36<>\"\",'SCORE CENTER'!A36,\"\")","v":""},"SCORE:",null,null,null,null,null,null,null,null,null,null,null,null,null,null,null,null,null,null,null,null,"COUNT:",{"$f":"COUNT(D116:W116)","v":0}]
[null,null,"RATING:",null,null,null,null,null,null,null,null,null,null,null,null,null,null,null,null,null,null,null,null,"-","-"]
[null,null,"SLOPE:",null,null,null,null,null,null,null,null,null,null,null,null,null,null,null,null,null,null,null,null,"HDAVG:",{"$f":"IF(D116<>\"\",Hdavg(D119:W119,Y116),\"\")","v":""}]
[null,null,"DIFF:",{"$f":"IF(D116<>\"\",HCDIF(D116,D117,D118),\"\")","v":""},{"$f":"IF(E116<>\"\",HCDIF(E116,E117,E118),\"\")","v":""},{"$f":"IF(F116<>\"\",HCDIF(F116,F117,F118),\"\")","v":""},{"$f":"IF(G116<>\"\",HCDIF(G116,G117,G118),\"\")","v":""},{"$f":"IF(H116<>\"\",HCDIF(H116,H117,H118),\"\")","v":""},{"$f":"IF(I116<>\"\",HCDIF(I116,I117,I118),\"\")","v":""},{"$f":"IF(J116<>\"\",HCDIF(J116,J117,J118),\"\")","v":""},{"$f":"IF(K116<>\"\",HCDIF(K116,K117,K118),\"\")","v":""},{"$f":"IF(L116<>\"\",HCDIF(L116,L117,L118),\"\")","v":""},{"$f":"IF(M116<>\"\",HCDIF(M116,M117,M118),\"\")","v":""},{"$f":"IF(N116<>\"\",HCDIF(N116,N117,N118),\"\")","v":""},{"$f":"IF(O116<>\"\",HCDIF(O116,O117,O118),\"\")","v":""},{"$f":"IF(P116<>\"\",HCDIF(P116,P117,P118),\"\")","v":""},{"$f":"IF(Q116<>\"\",HCDIF(Q116,Q117,Q118),\"\")","v":""},{"$f":"IF(R116<>\"\",HCDIF(R116,R117,R118),\"\")","v":""},{"$f":"IF(S116<>\"\",HCDIF(S116,S117,S118),\"\")","v":""},{"$f":"IF(T116<>\"\",HCDIF(T116,T117,T118),\"\")","v":""},{"$f":"IF(U116<>\"\",HCDIF(U116,U117,U118),\"\")","v":""},{"$f":"IF(V116<>\"\",HCDIF(V116,V117,V118),\"\")","v":""},{"$f":"IF(W116<>\"\",HCDIF(W116,W117,W118),\"\")","v":""},"INDEX:",{"$f":"IF(Y118<>\"\",HDIND(Y118),\"\")","v":""}]
[null,null,"WON:",null,null,null,null,null,null,null,null,null,null,null,null,null,null,null,null,null,null,null,null,"TOTAL:",{"$f":"IF(D120<>\"\",SUM(D120:W120),\"\")","v":""}]
[null,{"$f":"IF('SCORE CENTER'!A37<>\"\",'SCORE CENTER'!A37,\"\")","v":""},"SCORE:",null,null,null,null,null,null,null,null,null,null,null,null,null,null,null,null,null,null,null,null,"COUNT:",{"$f":"COUNT(D121:W121)","v":0}]
[null,null,"RATING:",null,null,null,null,null,null,null,null,null,null,null,null,null,null,null,null,null,null,null,null,"-","-"]
[null,null,"SLOPE:",null,null,null,null,null,null,null,null,null,null,null,null,null,null,null,null,null,null,null,null,"HDAVG:",{"$f":"IF(D121<>\"\",Hdavg(D124:W124,Y121),\"\")","v":""}]
[null,null,"DIFF:",{"$f":"IF(D121<>\"\",HCDIF(D121,D122,D123),\"\")","v":""},{"$f":"IF(E121<>\"\",HCDIF(E121,E122,E123),\"\")","v":""},{"$f":"IF(F121<>\"\",HCDIF(F121,F122,F123),\"\")","v":""},{"$f":"IF(G121<>\"\",HCDIF(G121,G122,G123),\"\")","v":""},{"$f":"IF(H121<>\"\",HCDIF(H121,H122,H123),\"\")","v":""},{"$f":"IF(I121<>\"\",HCDIF(I121,I122,I123),\"\")","v":""},{"$f":"IF(J121<>\"\",HCDIF(J121,J122,J123),\"\")","v":""},{"$f":"IF(K121<>\"\",HCDIF(K121,K122,K123),\"\")","v":""},{"$f":"IF(L121<>\"\",HCDIF(L121,L122,L123),\"\")","v":""},{"$f":"IF(M121<>\"\",HCDIF(M121,M122,M123),\"\")","v":""},{"$f":"IF(N121<>\"\",HCDIF(N121,N122,N123),\"\")","v":""},{"$f":"IF(O121<>\"\",HCDIF(O121,O122,O123),\"\")","v":""},{"$f":"IF(P121<>\"\",HCDIF(P121,P122,P123),\"\")","v":""},{"$f":"IF(Q121<>\"\",HCDIF(Q121,Q122,Q123),\"\")","v":""},{"$f":"IF(R121<>\"\",HCDIF(R121,R122,R123),\"\")","v":""},{"$f":"IF(S121<>\"\",HCDIF(S121,S122,S123),\"\")","v":""},{"$f":"IF(T121<>\"\",HCDIF(T121,T122,T123),\"\")","v":""},{"$f":"IF(U121<>\"\",HCDIF(U121,U122,U123),\"\")","v":""},{"$f":"IF(V121<>\"\",HCDIF(V121,V122,V123),\"\")","v":""},{"$f":"IF(W121<>\"\",HCDIF(W121,W122,W123),\"\")","v":""},"INDEX:",{"$f":"IF(Y123<>\"\",HDIND(Y123),\"\")","v":""}]
[null,null,"WON:",null,null,null,null,null,null,null,null,null,null,null,null,null,null,null,null,null,null,null,null,"TOTAL:",{"$f":"IF(D125<>\"\",SUM(D125:W125),\"\")","v":""}]
[null,{"$f":"IF('SCORE CENTER'!A38<>\"\",'SCORE CENTER'!A38,\"\")","v":""},"SCORE:",null,null,null,null,null,null,null,null,null,null,null,null,null,null,null,null,null,null,null,null,"COUNT:",{"$f":"COUNT(D126:W126)","v":0}]
[null,null,"RATING:",null,null,null,null,null,null,null,null,null,null,null,null,null,null,null,null,null,null,null,null,"-","-"]
[null,null,"SLOPE:",null,null,null,null,null,null,null,null,null,null,null,null,null,null,null,null,null,null,null,null,"HDAVG:",{"$f":"IF(D126<>\"\",Hdavg(D129:W129,Y126),\"\")","v":""}]
[null,null,"DIFF:",{"$f":"IF(D126<>\"\",HCDIF(D126,D127,D128),\"\")","v":""},{"$f":"IF(E126<>\"\",HCDIF(E126,E127,E128),\"\")","v":""},{"$f":"IF(F126<>\"\",HCDIF(F126,F127,F128),\"\")","v":""},{"$f":"IF(G126<>\"\",HCDIF(G126,G127,G128),\"\")","v":""},{"$f":"IF(H126<>\"\",HCDIF(H126,H127,H128),\"\")","v":""},{"$f":"IF(I126<>\"\",HCDIF(I126,I127,I128),\"\")","v":""},{"$f":"IF(J126<>\"\",HCDIF(J126,J127,J128),\"\")","v":""},{"$f":"IF(K126<>\"\",HCDIF(K126,K127,K128),\"\")","v":""},{"$f":"IF(L126<>\"\",HCDIF(L126,L127,L128),\"\")","v":""},{"$f":"IF(M126<>\"\",HCDIF(M126,M127,M128),\"\")","v":""},{"$f":"IF(N126<>\"\",HCDIF(N126,N127,N128),\"\")","v":""},{"$f":"IF(O126<>\"\",HCDIF(O126,O127,O128),\"\")","v":""},{"$f":"IF(P126<>\"\",HCDIF(P126,P127,P128),\"\")","v":""},{"$f":"IF(Q126<>\"\",HCDIF(Q126,Q127,Q128),\"\")","v":""},{"$f":"IF(R126<>\"\",HCDIF(R126,R127,R128),\"\")","v":""},{"$f":"IF(S126<>\"\",HCDIF(S126,S127,S128),\"\")","v":""},{"$f":"IF(T126<>\"\",HCDIF(T126,T127,T128),\"\")","v":""},{"$f":"IF(U126<>\"\",HCDIF(U126,U127,U128),\"\")","v":""},{"$f":"IF(V126<>\"\",HCDIF(V126,V127,V128),\"\")","v":""},{"$f":"IF(W126<>\"\",HCDIF(W126,W127,W128),\"\")","v":""},"INDEX:",{"$f":"IF(Y128<>\"\",HDIND(Y128),\"\")","v":""}]
[null,null,"WON:",null,null,null,null,null,null,null,null,null,null,null,null,null,null,null,null,null,null,null,null,"TOTAL:",{"$f":"IF(D130<>\"\",SUM(D130:W130),\"\")","v":""}]
[null,{"$f":"IF('SCORE CENTER'!A39<>\"\",'SCORE CENTER'!A39,\"\")","v":""},"SCORE:",null,null,null,null,null,null,null,null,null,null,null,null,null,null,null,null,null,null,null,null,"COUNT:",{"$f":"COUNT(D131:W131)","v":0}]
[null,null,"RATING:",null,null,null,null,null,null,null,null,null,null,null,null,null,null,null,null,null,null,null,null,"-","-"]
[null,null,"SLOPE:",null,null,null,null,null,null,null,null,null,null,null,null,null,null,null,null,null,null,null,null,"HDAVG:",{"$f":"IF(D131<>\"\",Hdavg(D134:W134,Y131),\"\")","v":""}]
[null,null,"DIFF:",{"$f":"IF(D131<>\"\",HCDIF(D131,D132,D133),\"\")","v":""},{"$f":"IF(E131<>\"\",HCDIF(E131,E132,E133),\"\")","v":""},{"$f":"IF(F131<>\"\",HCDIF(F131,F132,F133),\"\")","v":""},{"$f":"IF(G131<>\"\",HCDIF(G131,G132,G133),\"\")","v":""},{"$f":"IF(H131<>\"\",HCDIF(H131,H132,H133),\"\")","v":""},{"$f":"IF(I131<>\"\",HCDIF(I131,I132,I133),\"\")","v":""},{"$f":"IF(J131<>\"\",HCDIF(J131,J132,J133),\"\")","v":""},{"$f":"IF(K131<>\"\",HCDIF(K131,K132,K133),\"\")","v":""},{"$f":"IF(L131<>\"\",HCDIF(L131,L132,L133),\"\")","v":""},{"$f":"IF(M131<>\"\",HCDIF(M131,M132,M133),\"\")","v":""},{"$f":"IF(N131<>\"\",HCDIF(N131,N132,N133),\"\")","v":""},{"$f":"IF(O131<>\"\",HCDIF(O131,O132,O133),\"\")","v":""},{"$f":"IF(P131<>\"\",HCDIF(P131,P132,P133),\"\")","v":""},{"$f":"IF(Q131<>\"\",HCDIF(Q131,Q132,Q133),\"\")","v":""},{"$f":"IF(R131<>\"\",HCDIF(R131,R132,R133),\"\")","v":""},{"$f":"IF(S131<>\"\",HCDIF(S131,S132,S133),\"\")","v":""},{"$f":"IF(T131<>\"\",HCDIF(T131,T132,T133),\"\")","v":""},{"$f":"IF(U131<>\"\",HCDIF(U131,U132,U133),\"\")","v":""},{"$f":"IF(V131<>\"\",HCDIF(V131,V132,V133),\"\")","v":""},{"$f":"IF(W131<>\"\",HCDIF(W131,W132,W133),\"\")","v":""},"INDEX:",{"$f":"IF(Y133<>\"\",HDIND(Y133),\"\")","v":""}]
[null,null,"WON:",null,null,null,null,null,null,null,null,null,null,null,null,null,null,null,null,null,null,null,null,"TOTAL:",{"$f":"IF(D135<>\"\",SUM(D135:W135),\"\")","v":""}]
[null,{"$f":"IF('SCORE CENTER'!A40<>\"\",'SCORE CENTER'!A40,\"\")","v":""},"SCORE:",null,null,null,null,null,null,null,null,null,null,null,null,null,null,null,null,null,null,null,null,"COUNT:",{"$f":"COUNT(D136:W136)","v":0}]
[null,null,"RATING:",null,null,null,null,null,null,null,null,null,null,null,null,null,null,null,null,null,null,null,null,"-","-"]
[null,null,"SLOPE:",null,null,null,null,null,null,null,null,null,null,null,null,null,null,null,null,null,null,null,null,"HDAVG:",{"$f":"IF(D136<>\"\",Hdavg(D139:W139,Y136),\"\")","v":""}]
[null,null,"DIFF:",{"$f":"IF(D136<>\"\",HCDIF(D136,D137,D138),\"\")","v":""},{"$f":"IF(E136<>\"\",HCDIF(E136,E137,E138),\"\")","v":""},{"$f":"IF(F136<>\"\",HCDIF(F136,F137,F138),\"\")","v":""},{"$f":"IF(G136<>\"\",HCDIF(G136,G137,G138),\"\")","v":""},{"$f":"IF(H136<>\"\",HCDIF(H136,H137,H138),\"\")","v":""},{"$f":"IF(I136<>\"\",HCDIF(I136,I137,I138),\"\")","v":""},{"$f":"IF(J136<>\"\",HCDIF(J136,J137,J138),\"\")","v":""},{"$f":"IF(K136<>\"\",HCDIF(K136,K137,K138),\"\")","v":""},{"$f":"IF(L136<>\"\",HCDIF(L136,L137,L138),\"\")","v":""},{"$f":"IF(M136<>\"\",HCDIF(M136,M137,M138),\"\")","v":""},{"$f":"IF(N136<>\"\",HCDIF(N136,N137,N138),\"\")","v":""},{"$f":"IF(O136<>\"\",HCDIF(O136,O137,O138),\"\")","v":""},{"$f":"IF(P136<>\"\",HCDIF(P136,P137,P138),\"\")","v":""},{"$f":"IF(Q136<>\"\",HCDIF(Q136,Q137,Q138),\"\")","v":""},{"$f":"IF(R136<>\"\",HCDIF(R136,R137,R138),\"\")","v":""},{"$f":"IF(S136<>\"\",HCDIF(S136,S137,S138),\"\")","v":""},{"$f":"IF(T136<>\"\",HCDIF(T136,T137,T138),\"\")","v":""},{"$f":"IF(U136<>\"\",HCDIF(U136,U137,U138),\"\")","v":""},{"$f":"IF(V136<>\"\",HCDIF(V136,V137,V138),\"\")","v":""},{"$f":"IF(W136<>\"\",HCDIF(W136,W137,W138),\"\")","v":""},"INDEX:",{"$f":"IF(Y138<>\"\",HDIND(Y138),\"\")","v":""}]
[null,null,"WON:",null,null,null,null,null,null,null,null,null,null,null,null,null,null,null,null,null,null,null,null,"TOTAL:",{"$f":"IF(D140<>\"\",SUM(D140:W140),\"\")","v":""}]
[null,{"$f":"IF('SCORE CENTER'!A41<>\"\",'SCORE CENTER'!A41,\"\")","v":""},"SCORE:",null,null,null,null,null,null,null,null,null,null,null,null,null,null,null,null,null,null,null,null,"COUNT:",{"$f":"COUNT(D141:W141)","v":0}]
[null,null,"RATING:",null,null,null,null,null,null,null,null,null,null,null,null,null,null,null,null,null,null,null,null,"-","-"]
[null,null,"SLOPE:",null,null,null,null,null,null,null,null,null,null,null,null,null,null,null,null,null,null,null,null,"HDAVG:",{"$f":"IF(D141<>\"\",Hdavg(D144:W144,Y141),\"\")","v":""}]
[null,null,"DIFF:",{"$f":"IF(D141<>\"\",HCDIF(D141,D142,D143),\"\")","v":""},{"$f":"IF(E141<>\"\",HCDIF(E141,E142,E143),\"\")","v":""},{"$f":"IF(F141<>\"\",HCDIF(F141,F142,F143),\"\")","v":""},{"$f":"IF(G141<>\"\",HCDIF(G141,G142,G143),\"\")","v":""},{"$f":"IF(H141<>\"\",HCDIF(H141,H142,H143),\"\")","v":""},{"$f":"IF(I141<>\"\",HCDIF(I141,I142,I143),\"\")","v":""},{"$f":"IF(J141<>\"\",HCDIF(J141,J142,J143),\"\")","v":""},{"$f":"IF(K141<>\"\",HCDIF(K141,K142,K143),\"\")","v":""},{"$f":"IF(L141<>\"\",HCDIF(L141,L142,L143),\"\")","v":""},{"$f":"IF(M141<>\"\",HCDIF(M141,M142,M143),\"\")","v":""},{"$f":"IF(N141<>\"\",HCDIF(N141,N142,N143),\"\")","v":""},{"$f":"IF(O141<>\"\",HCDIF(O141,O142,O143),\"\")","v":""},{"$f":"IF(P141<>\"\",HCDIF(P141,P142,P143),\"\")","v":""},{"$f":"IF(Q141<>\"\",HCDIF(Q141,Q142,Q143),\"\")","v":""},{"$f":"IF(R141<>\"\",HCDIF(R141,R142,R143),\"\")","v":""},{"$f":"IF(S141<>\"\",HCDIF(S141,S142,S143),\"\")","v":""},{"$f":"IF(T141<>\"\",HCDIF(T141,T142,T143),\"\")","v":""},{"$f":"IF(U141<>\"\",HCDIF(U141,U142,U143),\"\")","v":""},{"$f":"IF(V141<>\"\",HCDIF(V141,V142,V143),\"\")","v":""},{"$f":"IF(W141<>\"\",HCDIF(W141,W142,W143),\"\")","v":""},"INDEX:",{"$f":"IF(Y143<>\"\",HDIND(Y143),\"\")","v":""}]
[null,null,"WON:",null,null,null,null,null,null,null,null,null,null,null,null,null,null,null,null,null,null,null,null,"TOTAL:",{"$f":"IF(D145<>\"\",SUM(D145:W145),\"\")","v":""}]
[null,{"$f":"IF('SCORE CENTER'!A42<>\"\",'SCORE CENTER'!A42,\"\")","v":""},"SCORE:",null,null,null,null,null,null,null,null,null,null,null,null,null,null,null,null,null,null,null,null,"COUNT:",{"$f":"COUNT(D146:W146)","v":0}]
[null,null,"RATING:",null,null,null,null,null,null,null,null,null,null,null,null,null,null,null,null,null,null,null,null,"-","-"]
[null,null,"SLOPE:",null,null,null,null,null,null,null,null,null,null,null,null,null,null,null,null,null,null,null,null,"HDAVG:",{"$f":"IF(D146<>\"\",Hdavg(D149:W149,Y146),\"\")","v":""}]
[null,null,"DIFF:",{"$f":"IF(D146<>\"\",HCDIF(D146,D147,D148),\"\")","v":""},{"$f":"IF(E146<>\"\",HCDIF(E146,E147,E148),\"\")","v":""},{"$f":"IF(F146<>\"\",HCDIF(F146,F147,F148),\"\")","v":""},{"$f":"IF(G146<>\"\",HCDIF(G146,G147,G148),\"\")","v":""},{"$f":"IF(H146<>\"\",HCDIF(H146,H147,H148),\"\")","v":""},{"$f":"IF(I146<>\"\",HCDIF(I146,I147,I148),\"\")","v":""},{"$f":"IF(J146<>\"\",HCDIF(J146,J147,J148),\"\")","v":""},{"$f":"IF(K146<>\"\",HCDIF(K146,K147,K148),\"\")","v":""},{"$f":"IF(L146<>\"\",HCDIF(L146,L147,L148),\"\")","v":""},{"$f":"IF(M146<>\"\",HCDIF(M146,M147,M148),\"\")","v":""},{"$f":"IF(N146<>\"\",HCDIF(N146,N147,N148),\"\")","v":""},{"$f":"IF(O146<>\"\",HCDIF(O146,O147,O148),\"\")","v":""},{"$f":"IF(P146<>\"\",HCDIF(P146,P147,P148),\"\")","v":""},{"$f":"IF(Q146<>\"\",HCDIF(Q146,Q147,Q148),\"\")","v":""},{"$f":"IF(R146<>\"\",HCDIF(R146,R147,R148),\"\")","v":""},{"$f":"IF(S146<>\"\",HCDIF(S146,S147,S148),\"\")","v":""},{"$f":"IF(T146<>\"\",HCDIF(T146,T147,T148),\"\")","v":""},{"$f":"IF(U146<>\"\",HCDIF(U146,U147,U148),\"\")","v":""},{"$f":"IF(V146<>\"\",HCDIF(V146,V147,V148),\"\")","v":""},{"$f":"IF(W146<>\"\",HCDIF(W146,W147,W148),\"\")","v":""},"INDEX:",{"$f":"IF(Y148<>\"\",HDIND(Y148),\"\")","v":""}]
[null,null,"WON:",null,null,null,null,null,null,null,null,null,null,null,null,null,null,null,null,null,null,null,null,"TOTAL:",{"$f":"IF(D150<>\"\",SUM(D150:W150),\"\")","v":""}]
[null,{"$f":"IF('SCORE CENTER'!A43<>\"\",'SCORE CENTER'!A43,\"\")","v":""},"SCORE:",null,null,null,null,null,null,null,null,null,null,null,null,null,null,null,null,null,null,null,null,"COUNT:",{"$f":"COUNT(D151:W151)","v":0}]
[null,null,"RATING:",null,null,null,null,null,null,null,null,null,null,null,null,null,null,null,null,null,null,null,null,"-","-"]
[null,null,"SLOPE:",null,null,null,null,null,null,null,null,null,null,null,null,null,null,null,null,null,null,null,null,"HDAVG:",{"$f":"IF(D151<>\"\",Hdavg(D154:W154,Y151),\"\")","v":""}]
[null,null,"DIFF:",{"$f":"IF(D151<>\"\",HCDIF(D151,D152,D153),\"\")","v":""},{"$f":"IF(E151<>\"\",HCDIF(E151,E152,E153),\"\")","v":""},{"$f":"IF(F151<>\"\",HCDIF(F151,F152,F153),\"\")","v":""},{"$f":"IF(G151<>\"\",HCDIF(G151,G152,G153),\"\")","v":""},{"$f":"IF(H151<>\"\",HCDIF(H151,H152,H153),\"\")","v":""},{"$f":"IF(I151<>\"\",HCDIF(I151,I152,I153),\"\")","v":""},{"$f":"IF(J151<>\"\",HCDIF(J151,J152,J153),\"\")","v":""},{"$f":"IF(K151<>\"\",HCDIF(K151,K152,K153),\"\")","v":""},{"$f":"IF(L151<>\"\",HCDIF(L151,L152,L153),\"\")","v":""},{"$f":"IF(M151<>\"\",HCDIF(M151,M152,M153),\"\")","v":""},{"$f":"IF(N151<>\"\",HCDIF(N151,N152,N153),\"\")","v":""},{"$f":"IF(O151<>\"\",HCDIF(O151,O152,O153),\"\")","v":""},{"$f":"IF(P151<>\"\",HCDIF(P151,P152,P153),\"\")","v":""},{"$f":"IF(Q151<>\"\",HCDIF(Q151,Q152,Q153),\"\")","v":""},{"$f":"IF(R151<>\"\",HCDIF(R151,R152,R153),\"\")","v":""},{"$f":"IF(S151<>\"\",HCDIF(S151,S152,S153),\"\")","v":""},{"$f":"IF(T151<>\"\",HCDIF(T151,T152,T153),\"\")","v":""},{"$f":"IF(U151<>\"\",HCDIF(U151,U152,U153),\"\")","v":""},{"$f":"IF(V151<>\"\",HCDIF(V151,V152,V153),\"\")","v":""},{"$f":"IF(W151<>\"\",HCDIF(W151,W152,W153),\"\")","v":""},"INDEX:",{"$f":"IF(Y153<>\"\",HDIND(Y153),\"\")","v":""}]
[null,null,"WON:",null,null,null,null,null,null,null,null,null,null,null,null,null,null,null,null,null,null,null,null,"TOTAL:",{"$f":"IF(D155<>\"\",SUM(D155:W155),\"\")","v":""}]
[null,{"$f":"IF('SCORE CENTER'!A44<>\"\",'SCORE CENTER'!A44,\"\")","v":""},"SCORE:",null,null,null,null,null,null,null,null,null,null,null,null,null,null,null,null,null,null,null,null,"COUNT:",{"$f":"COUNT(D156:W156)","v":0}]
[null,null,"RATING:",null,null,null,null,null,null,null,null,null,null,null,null,null,null,null,null,null,null,null,null,"-","-"]
[null,null,"SLOPE:",null,null,null,null,null,null,null,null,null,null,null,null,null,null,null,null,null,null,null,null,"HDAVG:",{"$f":"IF(D156<>\"\",Hdavg(D159:W159,Y156),\"\")","v":""}]
[null,null,"DIFF:",{"$f":"IF(D156<>\"\",HCDIF(D156,D157,D158),\"\")","v":""},{"$f":"IF(E156<>\"\",HCDIF(E156,E157,E158),\"\")","v":""},{"$f":"IF(F156<>\"\",HCDIF(F156,F157,F158),\"\")","v":""},{"$f":"IF(G156<>\"\",HCDIF(G156,G157,G158),\"\")","v":""},{"$f":"IF(H156<>\"\",HCDIF(H156,H157,H158),\"\")","v":""},{"$f":"IF(I156<>\"\",HCDIF(I156,I157,I158),\"\")","v":""},{"$f":"IF(J156<>\"\",HCDIF(J156,J157,J158),\"\")","v":""},{"$f":"IF(K156<>\"\",HCDIF(K156,K157,K158),\"\")","v":""},{"$f":"IF(L156<>\"\",HCDIF(L156,L157,L158),\"\")","v":""},{"$f":"IF(M156<>\"\",HCDIF(M156,M157,M158),\"\")","v":""},{"$f":"IF(N156<>\"\",HCDIF(N156,N157,N158),\"\")","v":""},{"$f":"IF(O156<>\"\",HCDIF(O156,O157,O158),\"\")","v":""},{"$f":"IF(P156<>\"\",HCDIF(P156,P157,P158),\"\")","v":""},{"$f":"IF(Q156<>\"\",HCDIF(Q156,Q157,Q158),\"\")","v":""},{"$f":"IF(R156<>\"\",HCDIF(R156,R157,R158),\"\")","v":""},{"$f":"IF(S156<>\"\",HCDIF(S156,S157,S158),\"\")","v":""},{"$f":"IF(T156<>\"\",HCDIF(T156,T157,T158),\"\")","v":""},{"$f":"IF(U156<>\"\",HCDIF(U156,U157,U158),\"\")","v":""},{"$f":"IF(V156<>\"\",HCDIF(V156,V157,V158),\"\")","v":""},{"$f":"IF(W156<>\"\",HCDIF(W156,W157,W158),\"\")","v":""},"INDEX:",{"$f":"IF(Y158<>\"\",HDIND(Y158),\"\")","v":""}]
[null,null,"WON:",null,null,null,null,null,null,null,null,null,null,null,null,null,null,null,null,null,null,null,null,"TOTAL:",{"$f":"IF(D160<>\"\",SUM(D160:W160),\"\")","v":""}]
[null,{"$f":"IF('SCORE CENTER'!A45<>\"\",'SCORE CENTER'!A45,\"\")","v":""},"SCORE:",null,null,null,null,null,null,null,null,null,null,null,null,null,null,null,null,null,null,null,null,"COUNT:",{"$f":"COUNT(D161:W161)","v":0}]
[null,null,"RATING:",null,null,null,null,null,null,null,null,null,null,null,null,null,null,null,null,null,null,null,null,"-","-"]
[null,null,"SLOPE:",null,null,null,null,null,null,null,null,null,null,null,null,null,null,null,null,null,null,null,null,"HDAVG:",{"$f":"IF(D161<>\"\",Hdavg(D164:W164,Y161),\"\")","v":""}]
[null,null,"DIFF:",{"$f":"IF(D161<>\"\",HCDIF(D161,D162,D163),\"\")","v":""},{"$f":"IF(E161<>\"\",HCDIF(E161,E162,E163),\"\")","v":""},{"$f":"IF(F161<>\"\",HCDIF(F161,F162,F163),\"\")","v":""},{"$f":"IF(G161<>\"\",HCDIF(G161,G162,G163),\"\")","v":""},{"$f":"IF(H161<>\"\",HCDIF(H161,H162,H163),\"\")","v":""},{"$f":"IF(I161<>\"\",HCDIF(I161,I162,I163),\"\")","v":""},{"$f":"IF(J161<>\"\",HCDIF(J161,J162,J163),\"\")","v":""},{"$f":"IF(K161<>\"\",HCDIF(K161,K162,K163),\"\")","v":""},{"$f":"IF(L161<>\"\",HCDIF(L161,L162,L163),\"\")","v":""},{"$f":"IF(M161<>\"\",HCDIF(M161,M162,M163),\"\")","v":""},{"$f":"IF(N161<>\"\",HCDIF(N161,N162,N163),\"\")","v":""},{"$f":"IF(O161<>\"\",HCDIF(O161,O162,O163),\"\")","v":""},{"$f":"IF(P161<>\"\",HCDIF(P161,P162,P163),\"\")","v":""},{"$f":"IF(Q161<>\"\",HCDIF(Q161,Q162,Q163),\"\")","v":""},{"$f":"IF(R161<>\"\",HCDIF(R161,R162,R163),\"\")","v":""},{"$f":"IF(S161<>\"\",HCDIF(S161,S162,S163),\"\")","v":""},{"$f":"IF(T161<>\"\",HCDIF(T161,T162,T163),\"\")","v":""},{"$f":"IF(U161<>\"\",HCDIF(U161,U162,U163),\"\")","v":""},{"$f":"IF(V161<>\"\",HCDIF(V161,V162,V163),\"\")","v":""},{"$f":"IF(W161<>\"\",HCDIF(W161,W162,W163),\"\")","v":""},"INDEX:",{"$f":"IF(Y163<>\"\",HDIND(Y163),\"\")","v":""}]
[null,null,"WON:",null,null,null,null,null,null,null,null,null,null,null,null,null,null,null,null,null,null,null,null,"TOTAL:",{"$f":"IF(D165<>\"\",SUM(D165:W165),\"\")","v":""}]
[null,{"$f":"IF('SCORE CENTER'!A46<>\"\",'SCORE CENTER'!A46,\"\")","v":""},"SCORE:",null,null,null,null,null,null,null,null,null,null,null,null,null,null,null,null,null,null,null,null,"COUNT:",{"$f":"COUNT(D166:W166)","v":0}]
[null,null,"RATING:",null,null,null,null,null,null,null,null,null,null,null,null,null,null,null,null,null,null,null,null,"-","-"]
[null,null,"SLOPE:",null,null,null,null,null,null,null,null,null,null,null,null,null,null,null,null,null,null,null,null,"HDAVG:",{"$f":"IF(D166<>\"\",Hdavg(D169:W169,Y166),\"\")","v":""}]
[null,null,"DIFF:",{"$f":"IF(D166<>\"\",HCDIF(D166,D167,D168),\"\")","v":""},{"$f":"IF(E166<>\"\",HCDIF(E166,E167,E168),\"\")","v":""},{"$f":"IF(F166<>\"\",HCDIF(F166,F167,F168),\"\")","v":""},{"$f":"IF(G166<>\"\",HCDIF(G166,G167,G168),\"\")","v":""},{"$f":"IF(H166<>\"\",HCDIF(H166,H167,H168),\"\")","v":""},{"$f":"IF(I166<>\"\",HCDIF(I166,I167,I168),\"\")","v":""},{"$f":"IF(J166<>\"\",HCDIF(J166,J167,J168),\"\")","v":""},{"$f":"IF(K166<>\"\",HCDIF(K166,K167,K168),\"\")","v":""},{"$f":"IF(L166<>\"\",HCDIF(L166,L167,L168),\"\")","v":""},{"$f":"IF(M166<>\"\",HCDIF(M166,M167,M168),\"\")","v":""},{"$f":"IF(N166<>\"\",HCDIF(N166,N167,N168),\"\")","v":""},{"$f":"IF(O166<>\"\",HCDIF(O166,O167,O168),\"\")","v":""},{"$f":"IF(P166<>\"\",HCDIF(P166,P167,P168),\"\")","v":""},{"$f":"IF(Q166<>\"\",HCDIF(Q166,Q167,Q168),\"\")","v":""},{"$f":"IF(R166<>\"\",HCDIF(R166,R167,R168),\"\")","v":""},{"$f":"IF(S166<>\"\",HCDIF(S166,S167,S168),\"\")","v":""},{"$f":"IF(T166<>\"\",HCDIF(T166,T167,T168),\"\")","v":""},{"$f":"IF(U166<>\"\",HCDIF(U166,U167,U168),\"\")","v":""},{"$f":"IF(V166<>\"\",HCDIF(V166,V167,V168),\"\")","v":""},{"$f":"IF(W166<>\"\",HCDIF(W166,W167,W168),\"\")","v":""},"INDEX:",{"$f":"IF(Y168<>\"\",HDIND(Y168),\"\")","v":""}]
[null,null,"WON:",null,null,null,null,null,null,null,null,null,null,null,null,null,null,null,null,null,null,null,null,"TOTAL:",{"$f":"IF(D170<>\"\",SUM(D170:W170),\"\")","v":""}]
[null,{"$f":"IF('SCORE CENTER'!A47<>\"\",'SCORE CENTER'!A47,\"\")","v":""},"SCORE:",null,null,null,null,null,null,null,null,null,null,null,null,null,null,null,null,null,null,null,null,"COUNT:",{"$f":"COUNT(D171:W171)","v":0}]
[null,null,"RATING:",null,null,null,null,null,null,null,null,null,null,null,null,null,null,null,null,null,null,null,null,"-","-"]
[null,null,"SLOPE:",null,null,null,null,null,null,null,null,null,null,null,null,null,null,null,null,null,null,null,null,"HDAVG:",{"$f":"IF(D171<>\"\",Hdavg(D174:W174,Y171),\"\")","v":""}]
[null,null,"DIFF:",{"$f":"IF(D171<>\"\",HCDIF(D171,D172,D173),\"\")","v":""},{"$f":"IF(E171<>\"\",HCDIF(E171,E172,E173),\"\")","v":""},{"$f":"IF(F171<>\"\",HCDIF(F171,F172,F173),\"\")","v":""},{"$f":"IF(G171<>\"\",HCDIF(G171,G172,G173),\"\")","v":""},{"$f":"IF(H171<>\"\",HCDIF(H171,H172,H173),\"\")","v":""},{"$f":"IF(I171<>\"\",HCDIF(I171,I172,I173),\"\")","v":""},{"$f":"IF(J171<>\"\",HCDIF(J171,J172,J173),\"\")","v":""},{"$f":"IF(K171<>\"\",HCDIF(K171,K172,K173),\"\")","v":""},{"$f":"IF(L171<>\"\",HCDIF(L171,L172,L173),\"\")","v":""},{"$f":"IF(M171<>\"\",HCDIF(M171,M172,M173),\"\")","v":""},{"$f":"IF(N171<>\"\",HCDIF(N171,N172,N173),\"\")","v":""},{"$f":"IF(O171<>\"\",HCDIF(O171,O172,O173),\"\")","v":""},{"$f":"IF(P171<>\"\",HCDIF(P171,P172,P173),\"\")","v":""},{"$f":"IF(Q171<>\"\",HCDIF(Q171,Q172,Q173),\"\")","v":""},{"$f":"IF(R171<>\"\",HCDIF(R171,R172,R173),\"\")","v":""},{"$f":"IF(S171<>\"\",HCDIF(S171,S172,S173),\"\")","v":""},{"$f":"IF(T171<>\"\",HCDIF(T171,T172,T173),\"\")","v":""},{"$f":"IF(U171<>\"\",HCDIF(U171,U172,U173),\"\")","v":""},{"$f":"IF(V171<>\"\",HCDIF(V171,V172,V173),\"\")","v":""},{"$f":"IF(W171<>\"\",HCDIF(W171,W172,W173),\"\")","v":""},"INDEX:",{"$f":"IF(Y173<>\"\",HDIND(Y173),\"\")","v":""}]
[null,null,"WON:",null,null,null,null,null,null,null,null,null,null,null,null,null,null,null,null,null,null,null,null,"TOTAL:",{"$f":"IF(D175<>\"\",SUM(D175:W175),\"\")","v":""}]
[null,{"$f":"IF('SCORE CENTER'!A48<>\"\",'SCORE CENTER'!A48,\"\")","v":""},"SCORE:",null,null,null,null,null,null,null,null,null,null,null,null,null,null,null,null,null,null,null,null,"COUNT:",{"$f":"COUNT(D176:W176)","v":0}]
[null,null,"RATING:",null,null,null,null,null,null,null,null,null,null,null,null,null,null,null,null,null,null,null,null,"-","-"]
[null,null,"SLOPE:",null,null,null,null,null,null,null,null,null,null,null,null,null,null,null,null,null,null,null,null,"HDAVG:",{"$f":"IF(D176<>\"\",Hdavg(D179:W179,Y176),\"\")","v":""}]
[null,null,"DIFF:",{"$f":"IF(D176<>\"\",HCDIF(D176,D177,D178),\"\")","v":""},{"$f":"IF(E176<>\"\",HCDIF(E176,E177,E178),\"\")","v":""},{"$f":"IF(F176<>\"\",HCDIF(F176,F177,F178),\"\")","v":""},{"$f":"IF(G176<>\"\",HCDIF(G176,G177,G178),\"\")","v":""},{"$f":"IF(H176<>\"\",HCDIF(H176,H177,H178),\"\")","v":""},{"$f":"IF(I176<>\"\",HCDIF(I176,I177,I178),\"\")","v":""},{"$f":"IF(J176<>\"\",HCDIF(J176,J177,J178),\"\")","v":""},{"$f":"IF(K176<>\"\",HCDIF(K176,K177,K178),\"\")","v":""},{"$f":"IF(L176<>\"\",HCDIF(L176,L177,L178),\"\")","v":""},{"$f":"IF(M176<>\"\",HCDIF(M176,M177,M178),\"\")","v":""},{"$f":"IF(N176<>\"\",HCDIF(N176,N177,N178),\"\")","v":""},{"$f":"IF(O176<>\"\",HCDIF(O176,O177,O178),\"\")","v":""},{"$f":"IF(P176<>\"\",HCDIF(P176,P177,P178),\"\")","v":""},{"$f":"IF(Q176<>\"\",HCDIF(Q176,Q177,Q178),\"\")","v":""},{"$f":"IF(R176<>\"\",HCDIF(R176,R177,R178),\"\")","v":""},{"$f":"IF(S176<>\"\",HCDIF(S176,S177,S178),\"\")","v":""},{"$f":"IF(T176<>\"\",HCDIF(T176,T177,T178),\"\")","v":""},{"$f":"IF(U176<>\"\",HCDIF(U176,U177,U178),\"\")","v":""},{"$f":"IF(V176<>\"\",HCDIF(V176,V177,V178),\"\")","v":""},{"$f":"IF(W176<>\"\",HCDIF(W176,W177,W178),\"\")","v":""},"INDEX:",{"$f":"IF(Y178<>\"\",HDIND(Y178),\"\")","v":""}]
[null,null,"WON:",null,null,null,null,null,null,null,null,null,null,null,null,null,null,null,null,null,null,null,null,"TOTAL:",{"$f":"IF(D180<>\"\",SUM(D180:W180),\"\")","v":""}]
[null,{"$f":"IF('SCORE CENTER'!A49<>\"\",'SCORE CENTER'!A49,\"\")","v":""},"SCORE:",null,null,null,null,null,null,null,null,null,null,null,null,null,null,null,null,null,null,null,null,"COUNT:",{"$f":"COUNT(D181:W181)","v":0}]
[null,null,"RATING:",null,null,null,null,null,null,null,null,null,null,null,null,null,null,null,null,null,null,null,null,"-","-"]
[null,null,"SLOPE:",null,null,null,null,null,null,null,null,null,null,null,null,null,null,null,null,null,null,null,null,"HDAVG:",{"$f":"IF(D181<>\"\",Hdavg(D184:W184,Y181),\"\")","v":""}]
[null,null,"DIFF:",{"$f":"IF(D181<>\"\",HCDIF(D181,D182,D183),\"\")","v":""},{"$f":"IF(E181<>\"\",HCDIF(E181,E182,E183),\"\")","v":""},{"$f":"IF(F181<>\"\",HCDIF(F181,F182,F183),\"\")","v":""},{"$f":"IF(G181<>\"\",HCDIF(G181,G182,G183),\"\")","v":""},{"$f":"IF(H181<>\"\",HCDIF(H181,H182,H183),\"\")","v":""},{"$f":"IF(I181<>\"\",HCDIF(I181,I182,I183),\"\")","v":""},{"$f":"IF(J181<>\"\",HCDIF(J181,J182,J183),\"\")","v":""},{"$f":"IF(K181<>\"\",HCDIF(K181,K182,K183),\"\")","v":""},{"$f":"IF(L181<>\"\",HCDIF(L181,L182,L183),\"\")","v":""},{"$f":"IF(M181<>\"\",HCDIF(M181,M182,M183),\"\")","v":""},{"$f":"IF(N181<>\"\",HCDIF(N181,N182,N183),\"\")","v":""},{"$f":"IF(O181<>\"\",HCDIF(O181,O182,O183),\"\")","v":""},{"$f":"IF(P181<>\"\",HCDIF(P181,P182,P183),\"\")","v":""},{"$f":"IF(Q181<>\"\",HCDIF(Q181,Q182,Q183),\"\")","v":""},{"$f":"IF(R181<>\"\",HCDIF(R181,R182,R183),\"\")","v":""},{"$f":"IF(S181<>\"\",HCDIF(S181,S182,S183),\"\")","v":""},{"$f":"IF(T181<>\"\",HCDIF(T181,T182,T183),\"\")","v":""},{"$f":"IF(U181<>\"\",HCDIF(U181,U182,U183),\"\")","v":""},{"$f":"IF(V181<>\"\",HCDIF(V181,V182,V183),\"\")","v":""},{"$f":"IF(W181<>\"\",HCDIF(W181,W182,W183),\"\")","v":""},"INDEX:",{"$f":"IF(Y183<>\"\",HDIND(Y183),\"\")","v":""}]
[null,null,"WON:",null,null,null,null,null,null,null,null,null,null,null,null,null,null,null,null,null,null,null,null,"TOTAL:",{"$f":"IF(D185<>\"\",SUM(D185:W185),\"\")","v":""}]
[null,{"$f":"IF('SCORE CENTER'!A50<>\"\",'SCORE CENTER'!A50,\"\")","v":""},"SCORE:",null,null,null,null,null,null,null,null,null,null,null,null,null,null,null,null,null,null,null,null,"COUNT:",{"$f":"COUNT(D186:W186)","v":0}]
[null,null,"RATING:",null,null,null,null,null,null,null,null,null,null,null,null,null,null,null,null,null,null,null,null,"-","-"]
[null,null,"SLOPE:",null,null,null,null,null,null,null,null,null,null,null,null,null,null,null,null,null,null,null,null,"HDAVG:",{"$f":"IF(D186<>\"\",Hdavg(D189:W189,Y186),\"\")","v":""}]
[null,null,"DIFF:",{"$f":"IF(D186<>\"\",HCDIF(D186,D187,D188),\"\")","v":""},{"$f":"IF(E186<>\"\",HCDIF(E186,E187,E188),\"\")","v":""},{"$f":"IF(F186<>\"\",HCDIF(F186,F187,F188),\"\")","v":""},{"$f":"IF(G186<>\"\",HCDIF(G186,G187,G188),\"\")","v":""},{"$f":"IF(H186<>\"\",HCDIF(H186,H187,H188),\"\")","v":""},{"$f":"IF(I186<>\"\",HCDIF(I186,I187,I188),\"\")","v":""},{"$f":"IF(J186<>\"\",HCDIF(J186,J187,J188),\"\")","v":""},{"$f":"IF(K186<>\"\",HCDIF(K186,K187,K188),\"\")","v":""},{"$f":"IF(L186<>\"\",HCDIF(L186,L187,L188),\"\")","v":""},{"$f":"IF(M186<>\"\",HCDIF(M186,M187,M188),\"\")","v":""},{"$f":"IF(N186<>\"\",HCDIF(N186,N187,N188),\"\")","v":""},{"$f":"IF(O186<>\"\",HCDIF(O186,O187,O188),\"\")","v":""},{"$f":"IF(P186<>\"\",HCDIF(P186,P187,P188),\"\")","v":""},{"$f":"IF(Q186<>\"\",HCDIF(Q186,Q187,Q188),\"\")","v":""},{"$f":"IF(R186<>\"\",HCDIF(R186,R187,R188),\"\")","v":""},{"$f":"IF(S186<>\"\",HCDIF(S186,S187,S188),\"\")","v":""},{"$f":"IF(T186<>\"\",HCDIF(T186,T187,T188),\"\")","v":""},{"$f":"IF(U186<>\"\",HCDIF(U186,U187,U188),\"\")","v":""},{"$f":"IF(V186<>\"\",HCDIF(V186,V187,V188),\"\")","v":""},{"$f":"IF(W186<>\"\",HCDIF(W186,W187,W188),\"\")","v":""},"INDEX:",{"$f":"IF(Y188<>\"\",HDIND(Y188),\"\")","v":""}]
[null,null,"WON:",null,null,null,null,null,null,null,null,null,null,null,null,null,null,null,null,null,null,null,null,"TOTAL:",{"$f":"IF(D190<>\"\",SUM(D190:W190),\"\")","v":""}]
[null,{"$f":"IF('SCORE CENTER'!A51<>\"\",'SCORE CENTER'!A51,\"\")","v":""},"SCORE:",null,null,null,null,null,null,null,null,null,null,null,null,null,null,null,null,null,null,null,null,"COUNT:",{"$f":"COUNT(D191:W191)","v":0}]
[null,null,"RATING:",null,null,null,null,null,null,null,null,null,null,null,null,null,null,null,null,null,null,null,null,"-","-"]
[null,null,"SLOPE:",null,null,null,null,null,null,null,null,null,null,null,null,null,null,null,null,null,null,null,null,"HDAVG:",{"$f":"IF(D191<>\"\",Hdavg(D194:W194,Y191),\"\")","v":""}]
[null,null,"DIFF:",{"$f":"IF(D191<>\"\",HCDIF(D191,D192,D193),\"\")","v":""},{"$f":"IF(E191<>\"\",HCDIF(E191,E192,E193),\"\")","v":""},{"$f":"IF(F191<>\"\",HCDIF(F191,F192,F193),\"\")","v":""},{"$f":"IF(G191<>\"\",HCDIF(G191,G192,G193),\"\")","v":""},{"$f":"IF(H191<>\"\",HCDIF(H191,H192,H193),\"\")","v":""},{"$f":"IF(I191<>\"\",HCDIF(I191,I192,I193),\"\")","v":""},{"$f":"IF(J191<>\"\",HCDIF(J191,J192,J193),\"\")","v":""},{"$f":"IF(K191<>\"\",HCDIF(K191,K192,K193),\"\")","v":""},{"$f":"IF(L191<>\"\",HCDIF(L191,L192,L193),\"\")","v":""},{"$f":"IF(M191<>\"\",HCDIF(M191,M192,M193),\"\")","v":""},{"$f":"IF(N191<>\"\",HCDIF(N191,N192,N193),\"\")","v":""},{"$f":"IF(O191<>\"\",HCDIF(O191,O192,O193),\"\")","v":""},{"$f":"IF(P191<>\"\",HCDIF(P191,P192,P193),\"\")","v":""},{"$f":"IF(Q191<>\"\",HCDIF(Q191,Q192,Q193),\"\")","v":""},{"$f":"IF(R191<>\"\",HCDIF(R191,R192,R193),\"\")","v":""},{"$f":"IF(S191<>\"\",HCDIF(S191,S192,S193),\"\")","v":""},{"$f":"IF(T191<>\"\",HCDIF(T191,T192,T193),\"\")","v":""},{"$f":"IF(U191<>\"\",HCDIF(U191,U192,U193),\"\")","v":""},{"$f":"IF(V191<>\"\",HCDIF(V191,V192,V193),\"\")","v":""},{"$f":"IF(W191<>\"\",HCDIF(W191,W192,W193),\"\")","v":""},"INDEX:",{"$f":"IF(Y193<>\"\",HDIND(Y193),\"\")","v":""}]
[null,null,"WON:",null,null,null,null,null,null,null,null,null,null,null,null,null,null,null,null,null,null,null,null,"TOTAL:",{"$f":"IF(D195<>\"\",SUM(D195:W195),\"\")","v":""}]
[null,{"$f":"IF('SCORE CENTER'!A52<>\"\",'SCORE CENTER'!A52,\"\")","v":""},"SCORE:",null,null,null,null,null,null,null,null,null,null,null,null,null,null,null,null,null,null,null,null,"COUNT:",{"$f":"COUNT(D196:W196)","v":0}]
[null,null,"RATING:",null,null,null,null,null,null,null,null,null,null,null,null,null,null,null,null,null,null,null,null,"-","-"]
[null,null,"SLOPE:",null,null,null,null,null,null,null,null,null,null,null,null,null,null,null,null,null,null,null,null,"HDAVG:",{"$f":"IF(D196<>\"\",Hdavg(D199:W199,Y196),\"\")","v":""}]
[null,null,"DIFF:",{"$f":"IF(D196<>\"\",HCDIF(D196,D197,D198),\"\")","v":""},{"$f":"IF(E196<>\"\",HCDIF(E196,E197,E198),\"\")","v":""},{"$f":"IF(F196<>\"\",HCDIF(F196,F197,F198),\"\")","v":""},{"$f":"IF(G196<>\"\",HCDIF(G196,G197,G198),\"\")","v":""},{"$f":"IF(H196<>\"\",HCDIF(H196,H197,H198),\"\")","v":""},{"$f":"IF(I196<>\"\",HCDIF(I196,I197,I198),\"\")","v":""},{"$f":"IF(J196<>\"\",HCDIF(J196,J197,J198),\"\")","v":""},{"$f":"IF(K196<>\"\",HCDIF(K196,K197,K198),\"\")","v":""},{"$f":"IF(L196<>\"\",HCDIF(L196,L197,L198),\"\")","v":""},{"$f":"IF(M196<>\"\",HCDIF(M196,M197,M198),\"\")","v":""},{"$f":"IF(N196<>\"\",HCDIF(N196,N197,N198),\"\")","v":""},{"$f":"IF(O196<>\"\",HCDIF(O196,O197,O198),\"\")","v":""},{"$f":"IF(P196<>\"\",HCDIF(P196,P197,P198),\"\")","v":""},{"$f":"IF(Q196<>\"\",HCDIF(Q196,Q197,Q198),\"\")","v":""},{"$f":"IF(R196<>\"\",HCDIF(R196,R197,R198),\"\")","v":""},{"$f":"IF(S196<>\"\",HCDIF(S196,S197,S198),\"\")","v":""},{"$f":"IF(T196<>\"\",HCDIF(T196,T197,T198),\"\")","v":""},{"$f":"IF(U196<>\"\",HCDIF(U196,U197,U198),\"\")","v":""},{"$f":"IF(V196<>\"\",HCDIF(V196,V197,V198),\"\")","v":""},{"$f":"IF(W196<>\"\",HCDIF(W196,W197,W198),\"\")","v":""},"INDEX:",{"$f":"IF(Y198<>\"\",HDIND(Y198),\"\")","v":""}]
[null,null,"WON:",null,null,null,null,null,null,null,null,null,null,null,null,null,null,null,null,null,null,null,null,"TOTAL:",{"$f":"IF(D200<>\"\",SUM(D200:W200),\"\")","v":""}]
[null,{"$f":"IF('SCORE CENTER'!A53<>\"\",'SCORE CENTER'!A53,\"\")","v":""},"SCORE:",null,null,null,null,null,null,null,null,null,null,null,null,null,null,null,null,null,null,null,null,"COUNT:",{"$f":"COUNT(D201:W201)","v":0}]
[null,null,"RATING:",null,null,null,null,null,null,null,null,null,null,null,null,null,null,null,null,null,null,null,null,"-","-"]
[null,null,"SLOPE:",null,null,null,null,null,null,null,null,null,null,null,null,null,null,null,null,null,null,null,null,"HDAVG:",{"$f":"IF(D201<>\"\",Hdavg(D204:W204,Y201),\"\")","v":""}]
[null,null,"DIFF:",{"$f":"IF(D201<>\"\",HCDIF(D201,D202,D203),\"\")","v":""},{"$f":"IF(E201<>\"\",HCDIF(E201,E202,E203),\"\")","v":""},{"$f":"IF(F201<>\"\",HCDIF(F201,F202,F203),\"\")","v":""},{"$f":"IF(G201<>\"\",HCDIF(G201,G202,G203),\"\")","v":""},{"$f":"IF(H201<>\"\",HCDIF(H201,H202,H203),\"\")","v":""},{"$f":"IF(I201<>\"\",HCDIF(I201,I202,I203),\"\")","v":""},{"$f":"IF(J201<>\"\",HCDIF(J201,J202,J203),\"\")","v":""},{"$f":"IF(K201<>\"\",HCDIF(K201,K202,K203),\"\")","v":""},{"$f":"IF(L201<>\"\",HCDIF(L201,L202,L203),\"\")","v":""},{"$f":"IF(M201<>\"\",HCDIF(M201,M202,M203),\"\")","v":""},{"$f":"IF(N201<>\"\",HCDIF(N201,N202,N203),\"\")","v":""},{"$f":"IF(O201<>\"\",HCDIF(O201,O202,O203),\"\")","v":""},{"$f":"IF(P201<>\"\",HCDIF(P201,P202,P203),\"\")","v":""},{"$f":"IF(Q201<>\"\",HCDIF(Q201,Q202,Q203),\"\")","v":""},{"$f":"IF(R201<>\"\",HCDIF(R201,R202,R203),\"\")","v":""},{"$f":"IF(S201<>\"\",HCDIF(S201,S202,S203),\"\")","v":""},{"$f":"IF(T201<>\"\",HCDIF(T201,T202,T203),\"\")","v":""},{"$f":"IF(U201<>\"\",HCDIF(U201,U202,U203),\"\")","v":""},{"$f":"IF(V201<>\"\",HCDIF(V201,V202,V203),\"\")","v":""},{"$f":"IF(W201<>\"\",HCDIF(W201,W202,W203),\"\")","v":""},"INDEX:",{"$f":"IF(Y203<>\"\",HDIND(Y203),\"\")","v":""}]
[null,null,"WON:",null,null,null,null,null,null,null,null,null,null,null,null,null,null,null,null,null,null,null,null,"TOTAL:",{"$f":"IF(D205<>\"\",SUM(D205:W205),\"\")","v":""}]
[null,{"$f":"IF('SCORE CENTER'!A54<>\"\",'SCORE CENTER'!A54,\"\")","v":""},"SCORE:",null,null,null,null,null,null,null,null,null,null,null,null,null,null,null,null,null,null,null,null,"COUNT:",{"$f":"COUNT(D206:W206)","v":0}]
[null,null,"RATING:",null,null,null,null,null,null,null,null,null,null,null,null,null,null,null,null,null,null,null,null,"-","-"]
[null,null,"SLOPE:",null,null,null,null,null,null,null,null,null,null,null,null,null,null,null,null,null,null,null,null,"HDAVG:",{"$f":"IF(D206<>\"\",Hdavg(D209:W209,Y206),\"\")","v":""}]
[null,null,"DIFF:",{"$f":"IF(D206<>\"\",HCDIF(D206,D207,D208),\"\")","v":""},{"$f":"IF(E206<>\"\",HCDIF(E206,E207,E208),\"\")","v":""},{"$f":"IF(F206<>\"\",HCDIF(F206,F207,F208),\"\")","v":""},{"$f":"IF(G206<>\"\",HCDIF(G206,G207,G208),\"\")","v":""},{"$f":"IF(H206<>\"\",HCDIF(H206,H207,H208),\"\")","v":""},{"$f":"IF(I206<>\"\",HCDIF(I206,I207,I208),\"\")","v":""},{"$f":"IF(J206<>\"\",HCDIF(J206,J207,J208),\"\")","v":""},{"$f":"IF(K206<>\"\",HCDIF(K206,K207,K208),\"\")","v":""},{"$f":"IF(L206<>\"\",HCDIF(L206,L207,L208),\"\")","v":""},{"$f":"IF(M206<>\"\",HCDIF(M206,M207,M208),\"\")","v":""},{"$f":"IF(N206<>\"\",HCDIF(N206,N207,N208),\"\")","v":""},{"$f":"IF(O206<>\"\",HCDIF(O206,O207,O208),\"\")","v":""},{"$f":"IF(P206<>\"\",HCDIF(P206,P207,P208),\"\")","v":""},{"$f":"IF(Q206<>\"\",HCDIF(Q206,Q207,Q208),\"\")","v":""},{"$f":"IF(R206<>\"\",HCDIF(R206,R207,R208),\"\")","v":""},{"$f":"IF(S206<>\"\",HCDIF(S206,S207,S208),\"\")","v":""},{"$f":"IF(T206<>\"\",HCDIF(T206,T207,T208),\"\")","v":""},{"$f":"IF(U206<>\"\",HCDIF(U206,U207,U208),\"\")","v":""},{"$f":"IF(V206<>\"\",HCDIF(V206,V207,V208),\"\")","v":""},{"$f":"IF(W206<>\"\",HCDIF(W206,W207,W208),\"\")","v":""},"INDEX:",{"$f":"IF(Y208<>\"\",HDIND(Y208),\"\")","v":""}]
[null,null,"WON:",null,null,null,null,null,null,null,null,null,null,null,null,null,null,null,null,null,null,null,null,"TOTAL:",{"$f":"IF(D210<>\"\",SUM(D210:W210),\"\")","v":""}]
[null,{"$f":"IF('SCORE CENTER'!A55<>\"\",'SCORE CENTER'!A55,\"\")","v":""},"SCORE:",null,null,null,null,null,null,null,null,null,null,null,null,null,null,null,null,null,null,null,null,"COUNT:",{"$f":"COUNT(D211:W211)","v":0}]
[null,null,"RATING:",null,null,null,null,null,null,null,null,null,null,null,null,null,null,null,null,null,null,null,null,"-","-"]
[null,null,"SLOPE:",null,null,null,null,null,null,null,null,null,null,null,null,null,null,null,null,null,null,null,null,"HDAVG:",{"$f":"IF(D211<>\"\",Hdavg(D214:W214,Y211),\"\")","v":""}]
[null,null,"DIFF:",{"$f":"IF(D211<>\"\",HCDIF(D211,D212,D213),\"\")","v":""},{"$f":"IF(E211<>\"\",HCDIF(E211,E212,E213),\"\")","v":""},{"$f":"IF(F211<>\"\",HCDIF(F211,F212,F213),\"\")","v":""},{"$f":"IF(G211<>\"\",HCDIF(G211,G212,G213),\"\")","v":""},{"$f":"IF(H211<>\"\",HCDIF(H211,H212,H213),\"\")","v":""},{"$f":"IF(I211<>\"\",HCDIF(I211,I212,I213),\"\")","v":""},{"$f":"IF(J211<>\"\",HCDIF(J211,J212,J213),\"\")","v":""},{"$f":"IF(K211<>\"\",HCDIF(K211,K212,K213),\"\")","v":""},{"$f":"IF(L211<>\"\",HCDIF(L211,L212,L213),\"\")","v":""},{"$f":"IF(M211<>\"\",HCDIF(M211,M212,M213),\"\")","v":""},{"$f":"IF(N211<>\"\",HCDIF(N211,N212,N213),\"\")","v":""},{"$f":"IF(O211<>\"\",HCDIF(O211,O212,O213),\"\")","v":""},{"$f":"IF(P211<>\"\",HCDIF(P211,P212,P213),\"\")","v":""},{"$f":"IF(Q211<>\"\",HCDIF(Q211,Q212,Q213),\"\")","v":""},{"$f":"IF(R211<>\"\",HCDIF(R211,R212,R213),\"\")","v":""},{"$f":"IF(S211<>\"\",HCDIF(S211,S212,S213),\"\")","v":""},{"$f":"IF(T211<>\"\",HCDIF(T211,T212,T213),\"\")","v":""},{"$f":"IF(U211<>\"\",HCDIF(U211,U212,U213),\"\")","v":""},{"$f":"IF(V211<>\"\",HCDIF(V211,V212,V213),\"\")","v":""},{"$f":"IF(W211<>\"\",HCDIF(W211,W212,W213),\"\")","v":""},"INDEX:",{"$f":"IF(Y213<>\"\",HDIND(Y213),\"\")","v":""}]
[null,null,"WON:",null,null,null,null,null,null,null,null,null,null,null,null,null,null,null,null,null,null,null,null,"TOTAL:",{"$f":"IF(D215<>\"\",SUM(D215:W215),\"\")","v":""}]
[null,{"$f":"IF('SCORE CENTER'!A56<>\"\",'SCORE CENTER'!A56,\"\")","v":""},"SCORE:",null,null,null,null,null,null,null,null,null,null,null,null,null,null,null,null,null,null,null,null,"COUNT:",{"$f":"COUNT(D216:W216)","v":0}]
[null,null,"RATING:",null,null,null,null,null,null,null,null,null,null,null,null,null,null,null,null,null,null,null,null,"-","-"]
[null,null,"SLOPE:",null,null,null,null,null,null,null,null,null,null,null,null,null,null,null,null,null,null,null,null,"HDAVG:",{"$f":"IF(D216<>\"\",Hdavg(D219:W219,Y216),\"\")","v":""}]
[null,null,"DIFF:",{"$f":"IF(D216<>\"\",HCDIF(D216,D217,D218),\"\")","v":""},{"$f":"IF(E216<>\"\",HCDIF(E216,E217,E218),\"\")","v":""},{"$f":"IF(F216<>\"\",HCDIF(F216,F217,F218),\"\")","v":""},{"$f":"IF(G216<>\"\",HCDIF(G216,G217,G218),\"\")","v":""},{"$f":"IF(H216<>\"\",HCDIF(H216,H217,H218),\"\")","v":""},{"$f":"IF(I216<>\"\",HCDIF(I216,I217,I218),\"\")","v":""},{"$f":"IF(J216<>\"\",HCDIF(J216,J217,J218),\"\")","v":""},{"$f":"IF(K216<>\"\",HCDIF(K216,K217,K218),\"\")","v":""},{"$f":"IF(L216<>\"\",HCDIF(L216,L217,L218),\"\")","v":""},{"$f":"IF(M216<>\"\",HCDIF(M216,M217,M218),\"\")","v":""},{"$f":"IF(N216<>\"\",HCDIF(N216,N217,N218),\"\")","v":""},{"$f":"IF(O216<>\"\",HCDIF(O216,O217,O218),\"\")","v":""},{"$f":"IF(P216<>\"\",HCDIF(P216,P217,P218),\"\")","v":""},{"$f":"IF(Q216<>\"\",HCDIF(Q216,Q217,Q218),\"\")","v":""},{"$f":"IF(R216<>\"\",HCDIF(R216,R217,R218),\"\")","v":""},{"$f":"IF(S216<>\"\",HCDIF(S216,S217,S218),\"\")","v":""},{"$f":"IF(T216<>\"\",HCDIF(T216,T217,T218),\"\")","v":""},{"$f":"IF(U216<>\"\",HCDIF(U216,U217,U218),\"\")","v":""},{"$f":"IF(V216<>\"\",HCDIF(V216,V217,V218),\"\")","v":""},{"$f":"IF(W216<>\"\",HCDIF(W216,W217,W218),\"\")","v":""},"INDEX:",{"$f":"IF(Y218<>\"\",HDIND(Y218),\"\")","v":""}]
[null,null,"WON:",null,null,null,null,null,null,null,null,null,null,null,null,null,null,null,null,null,null,null,null,"TOTAL:",{"$f":"IF(D220<>\"\",SUM(D220:W220),\"\")","v":""}]
[null,{"$f":"IF('SCORE CENTER'!A57<>\"\",'SCORE CENTER'!A57,\"\")","v":""},"SCORE:",null,null,null,null,null,null,null,null,null,null,null,null,null,null,null,null,null,null,null,null,"COUNT:",{"$f":"COUNT(D221:W221)","v":0}]
[null,null,"RATING:",null,null,null,null,null,null,null,null,null,null,null,null,null,null,null,null,null,null,null,null,"-","-"]
[null,null,"SLOPE:",null,null,null,null,null,null,null,null,null,null,null,null,null,null,null,null,null,null,null,null,"HDAVG:",{"$f":"IF(D221<>\"\",Hdavg(D224:W224,Y221),\"\")","v":""}]
[null,null,"DIFF:",{"$f":"IF(D221<>\"\",HCDIF(D221,D222,D223),\"\")","v":""},{"$f":"IF(E221<>\"\",HCDIF(E221,E222,E223),\"\")","v":""},{"$f":"IF(F221<>\"\",HCDIF(F221,F222,F223),\"\")","v":""},{"$f":"IF(G221<>\"\",HCDIF(G221,G222,G223),\"\")","v":""},{"$f":"IF(H221<>\"\",HCDIF(H221,H222,H223),\"\")","v":""},{"$f":"IF(I221<>\"\",HCDIF(I221,I222,I223),\"\")","v":""},{"$f":"IF(J221<>\"\",HCDIF(J221,J222,J223),\"\")","v":""},{"$f":"IF(K221<>\"\",HCDIF(K221,K222,K223),\"\")","v":""},{"$f":"IF(L221<>\"\",HCDIF(L221,L222,L223),\"\")","v":""},{"$f":"IF(M221<>\"\",HCDIF(M221,M222,M223),\"\")","v":""},{"$f":"IF(N221<>\"\",HCDIF(N221,N222,N223),\"\")","v":""},{"$f":"IF(O221<>\"\",HCDIF(O221,O222,O223),\"\")","v":""},{"$f":"IF(P221<>\"\",HCDIF(P221,P222,P223),\"\")","v":""},{"$f":"IF(Q221<>\"\",HCDIF(Q221,Q222,Q223),\"\")","v":""},{"$f":"IF(R221<>\"\",HCDIF(R221,R222,R223),\"\")","v":""},{"$f":"IF(S221<>\"\",HCDIF(S221,S222,S223),\"\")","v":""},{"$f":"IF(T221<>\"\",HCDIF(T221,T222,T223),\"\")","v":""},{"$f":"IF(U221<>\"\",HCDIF(U221,U222,U223),\"\")","v":""},{"$f":"IF(V221<>\"\",HCDIF(V221,V222,V223),\"\")","v":""},{"$f":"IF(W221<>\"\",HCDIF(W221,W222,W223),\"\")","v":""},"INDEX:",{"$f":"IF(Y223<>\"\",HDIND(Y223),\"\")","v":""}]
[null,null,"WON:",null,null,null,null,null,null,null,null,null,null,null,null,null,null,null,null,null,null,null,null,"TOTAL:",{"$f":"IF(D225<>\"\",SUM(D225:W225),\"\")","v":""}]
[null,{"$f":"IF('SCORE CENTER'!A58<>\"\",'SCORE CENTER'!A58,\"\")","v":""},"SCORE:",null,null,null,null,null,null,null,null,null,null,null,null,null,null,null,null,null,null,null,null,"COUNT:",{"$f":"COUNT(D226:W226)","v":0}]
[null,null,"RATING:",null,null,null,null,null,null,null,null,null,null,null,null,null,null,null,null,null,null,null,null,"-","-"]
[null,null,"SLOPE:",null,null,null,null,null,null,null,null,null,null,null,null,null,null,null,null,null,null,null,null,"HDAVG:",{"$f":"IF(D226<>\"\",Hdavg(D229:W229,Y226),\"\")","v":""}]
[null,null,"DIFF:",{"$f":"IF(D226<>\"\",HCDIF(D226,D227,D228),\"\")","v":""},{"$f":"IF(E226<>\"\",HCDIF(E226,E227,E228),\"\")","v":""},{"$f":"IF(F226<>\"\",HCDIF(F226,F227,F228),\"\")","v":""},{"$f":"IF(G226<>\"\",HCDIF(G226,G227,G228),\"\")","v":""},{"$f":"IF(H226<>\"\",HCDIF(H226,H227,H228),\"\")","v":""},{"$f":"IF(I226<>\"\",HCDIF(I226,I227,I228),\"\")","v":""},{"$f":"IF(J226<>\"\",HCDIF(J226,J227,J228),\"\")","v":""},{"$f":"IF(K226<>\"\",HCDIF(K226,K227,K228),\"\")","v":""},{"$f":"IF(L226<>\"\",HCDIF(L226,L227,L228),\"\")","v":""},{"$f":"IF(M226<>\"\",HCDIF(M226,M227,M228),\"\")","v":""},{"$f":"IF(N226<>\"\",HCDIF(N226,N227,N228),\"\")","v":""},{"$f":"IF(O226<>\"\",HCDIF(O226,O227,O228),\"\")","v":""},{"$f":"IF(P226<>\"\",HCDIF(P226,P227,P228),\"\")","v":""},{"$f":"IF(Q226<>\"\",HCDIF(Q226,Q227,Q228),\"\")","v":""},{"$f":"IF(R226<>\"\",HCDIF(R226,R227,R228),\"\")","v":""},{"$f":"IF(S226<>\"\",HCDIF(S226,S227,S228),\"\")","v":""},{"$f":"IF(T226<>\"\",HCDIF(T226,T227,T228),\"\")","v":""},{"$f":"IF(U226<>\"\",HCDIF(U226,U227,U228),\"\")","v":""},{"$f":"IF(V226<>\"\",HCDIF(V226,V227,V228),\"\")","v":""},{"$f":"IF(W226<>\"\",HCDIF(W226,W227,W228),\"\")","v":""},"INDEX:",{"$f":"IF(Y228<>\"\",HDIND(Y228),\"\")","v":""}]
[null,null,"WON:",null,null,null,null,null,null,null,null,null,null,null,null,null,null,null,null,null,null,null,null,"TOTAL:",{"$f":"IF(D230<>\"\",SUM(D230:W230),\"\")","v":""}]
[null,{"$f":"IF('SCORE CENTER'!A59<>\"\",'SCORE CENTER'!A59,\"\")","v":""},"SCORE:",null,null,null,null,null,null,null,null,null,null,null,null,null,null,null,null,null,null,null,null,"COUNT:",{"$f":"COUNT(D231:W231)","v":0}]
[null,null,"RATING:",null,null,null,null,null,null,null,null,null,null,null,null,null,null,null,null,null,null,null,null,"-","-"]
[null,null,"SLOPE:",null,null,null,null,null,null,null,null,null,null,null,null,null,null,null,null,null,null,null,null,"HDAVG:",{"$f":"IF(D231<>\"\",Hdavg(D234:W234,Y231),\"\")","v":""}]
[null,null,"DIFF:",{"$f":"IF(D231<>\"\",HCDIF(D231,D232,D233),\"\")","v":""},{"$f":"IF(E231<>\"\",HCDIF(E231,E232,E233),\"\")","v":""},{"$f":"IF(F231<>\"\",HCDIF(F231,F232,F233),\"\")","v":""},{"$f":"IF(G231<>\"\",HCDIF(G231,G232,G233),\"\")","v":""},{"$f":"IF(H231<>\"\",HCDIF(H231,H232,H233),\"\")","v":""},{"$f":"IF(I231<>\"\",HCDIF(I231,I232,I233),\"\")","v":""},{"$f":"IF(J231<>\"\",HCDIF(J231,J232,J233),\"\")","v":""},{"$f":"IF(K231<>\"\",HCDIF(K231,K232,K233),\"\")","v":""},{"$f":"IF(L231<>\"\",HCDIF(L231,L232,L233),\"\")","v":""},{"$f":"IF(M231<>\"\",HCDIF(M231,M232,M233),\"\")","v":""},{"$f":"IF(N231<>\"\",HCDIF(N231,N232,N233),\"\")","v":""},{"$f":"IF(O231<>\"\",HCDIF(O231,O232,O233),\"\")","v":""},{"$f":"IF(P231<>\"\",HCDIF(P231,P232,P233),\"\")","v":""},{"$f":"IF(Q231<>\"\",HCDIF(Q231,Q232,Q233),\"\")","v":""},{"$f":"IF(R231<>\"\",HCDIF(R231,R232,R233),\"\")","v":""},{"$f":"IF(S231<>\"\",HCDIF(S231,S232,S233),\"\")","v":""},{"$f":"IF(T231<>\"\",HCDIF(T231,T232,T233),\"\")","v":""},{"$f":"IF(U231<>\"\",HCDIF(U231,U232,U233),\"\")","v":""},{"$f":"IF(V231<>\"\",HCDIF(V231,V232,V233),\"\")","v":""},{"$f":"IF(W231<>\"\",HCDIF(W231,W232,W233),\"\")","v":""},"INDEX:",{"$f":"IF(Y233<>\"\",HDIND(Y233),\"\")","v":""}]
[null,null,"WON:",null,null,null,null,null,null,null,null,null,null,null,null,null,null,null,null,null,null,null,null,"TOTAL:",{"$f":"IF(D235<>\"\",SUM(D235:W235),\"\")","v":""}]
[null,{"$f":"IF('SCORE CENTER'!A60<>\"\",'SCORE CENTER'!A60,\"\")","v":""},"SCORE:",null,null,null,null,null,null,null,null,null,null,null,null,null,null,null,null,null,null,null,null,"COUNT:",{"$f":"COUNT(D236:W236)","v":0}]
[null,null,"RATING:",null,null,null,null,null,null,null,null,null,null,null,null,null,null,null,null,null,null,null,null,"-","-"]
[null,null,"SLOPE:",null,null,null,null,null,null,null,null,null,null,null,null,null,null,null,null,null,null,null,null,"HDAVG:",{"$f":"IF(D236<>\"\",Hdavg(D239:W239,Y236),\"\")","v":""}]
[null,null,"DIFF:",{"$f":"IF(D236<>\"\",HCDIF(D236,D237,D238),\"\")","v":""},{"$f":"IF(E236<>\"\",HCDIF(E236,E237,E238),\"\")","v":""},{"$f":"IF(F236<>\"\",HCDIF(F236,F237,F238),\"\")","v":""},{"$f":"IF(G236<>\"\",HCDIF(G236,G237,G238),\"\")","v":""},{"$f":"IF(H236<>\"\",HCDIF(H236,H237,H238),\"\")","v":""},{"$f":"IF(I236<>\"\",HCDIF(I236,I237,I238),\"\")","v":""},{"$f":"IF(J236<>\"\",HCDIF(J236,J237,J238),\"\")","v":""},{"$f":"IF(K236<>\"\",HCDIF(K236,K237,K238),\"\")","v":""},{"$f":"IF(L236<>\"\",HCDIF(L236,L237,L238),\"\")","v":""},{"$f":"IF(M236<>\"\",HCDIF(M236,M237,M238),\"\")","v":""},{"$f":"IF(N236<>\"\",HCDIF(N236,N237,N238),\"\")","v":""},{"$f":"IF(O236<>\"\",HCDIF(O236,O237,O238),\"\")","v":""},{"$f":"IF(P236<>\"\",HCDIF(P236,P237,P238),\"\")","v":""},{"$f":"IF(Q236<>\"\",HCDIF(Q236,Q237,Q238),\"\")","v":""},{"$f":"IF(R236<>\"\",HCDIF(R236,R237,R238),\"\")","v":""},{"$f":"IF(S236<>\"\",HCDIF(S236,S237,S238),\"\")","v":""},{"$f":"IF(T236<>\"\",HCDIF(T236,T237,T238),\"\")","v":""},{"$f":"IF(U236<>\"\",HCDIF(U236,U237,U238),\"\")","v":""},{"$f":"IF(V236<>\"\",HCDIF(V236,V237,V238),\"\")","v":""},{"$f":"IF(W236<>\"\",HCDIF(W236,W237,W238),\"\")","v":""},"INDEX:",{"$f":"IF(Y238<>\"\",HDIND(Y238),\"\")","v":""}]
[null,null,"WON:",null,null,null,null,null,null,null,null,null,null,null,null,null,null,null,null,null,null,null,null,"TOTAL:",{"$f":"IF(D240<>\"\",SUM(D240:W240),\"\")","v":""}]
[null,{"$f":"IF('SCORE CENTER'!A61<>\"\",'SCORE CENTER'!A61,\"\")","v":""},"SCORE:",null,null,null,null,null,null,null,null,null,null,null,null,null,null,null,null,null,null,null,null,"COUNT:",{"$f":"COUNT(D241:W241)","v":0}]
[null,null,"RATING:",null,null,null,null,null,null,null,null,null,null,null,null,null,null,null,null,null,null,null,null,"-","-"]
[null,null,"SLOPE:",null,null,null,null,null,null,null,null,null,null,null,null,null,null,null,null,null,null,null,null,"HDAVG:",{"$f":"IF(D241<>\"\",Hdavg(D244:W244,Y241),\"\")","v":""}]
[null,null,"DIFF:",{"$f":"IF(D241<>\"\",HCDIF(D241,D242,D243),\"\")","v":""},{"$f":"IF(E241<>\"\",HCDIF(E241,E242,E243),\"\")","v":""},{"$f":"IF(F241<>\"\",HCDIF(F241,F242,F243),\"\")","v":""},{"$f":"IF(G241<>\"\",HCDIF(G241,G242,G243),\"\")","v":""},{"$f":"IF(H241<>\"\",HCDIF(H241,H242,H243),\"\")","v":""},{"$f":"IF(I241<>\"\",HCDIF(I241,I242,I243),\"\")","v":""},{"$f":"IF(J241<>\"\",HCDIF(J241,J242,J243),\"\")","v":""},{"$f":"IF(K241<>\"\",HCDIF(K241,K242,K243),\"\")","v":""},{"$f":"IF(L241<>\"\",HCDIF(L241,L242,L243),\"\")","v":""},{"$f":"IF(M241<>\"\",HCDIF(M241,M242,M243),\"\")","v":""},{"$f":"IF(N241<>\"\",HCDIF(N241,N242,N243),\"\")","v":""},{"$f":"IF(O241<>\"\",HCDIF(O241,O242,O243),\"\")","v":""},{"$f":"IF(P241<>\"\",HCDIF(P241,P242,P243),\"\")","v":""},{"$f":"IF(Q241<>\"\",HCDIF(Q241,Q242,Q243),\"\")","v":""},{"$f":"IF(R241<>\"\",HCDIF(R241,R242,R243),\"\")","v":""},{"$f":"IF(S241<>\"\",HCDIF(S241,S242,S243),\"\")","v":""},{"$f":"IF(T241<>\"\",HCDIF(T241,T242,T243),\"\")","v":""},{"$f":"IF(U241<>\"\",HCDIF(U241,U242,U243),\"\")","v":""},{"$f":"IF(V241<>\"\",HCDIF(V241,V242,V243),\"\")","v":""},{"$f":"IF(W241<>\"\",HCDIF(W241,W242,W243),\"\")","v":""},"INDEX:",{"$f":"IF(Y243<>\"\",HDIND(Y243),\"\")","v":""}]
[null,null,"WON:",null,null,null,null,null,null,null,null,null,null,null,null,null,null,null,null,null,null,null,null,"TOTAL:",{"$f":"IF(D245<>\"\",SUM(D245:W245),\"\")","v":""}]
[null,{"$f":"IF('SCORE CENTER'!A62<>\"\",'SCORE CENTER'!A62,\"\")","v":""},"SCORE:",null,null,null,null,null,null,null,null,null,null,null,null,null,null,null,null,null,null,null,null,"COUNT:",{"$f":"COUNT(D246:W246)","v":0}]
[null,null,"RATING:",null,null,null,null,null,null,null,null,null,null,null,null,null,null,null,null,null,null,null,null,"-","-"]
[null,null,"SLOPE:",null,null,null,null,null,null,null,null,null,null,null,null,null,null,null,null,null,null,null,null,"HDAVG:",{"$f":"IF(D246<>\"\",Hdavg(D249:W249,Y246),\"\")","v":""}]
[null,null,"DIFF:",{"$f":"IF(D246<>\"\",HCDIF(D246,D247,D248),\"\")","v":""},{"$f":"IF(E246<>\"\",HCDIF(E246,E247,E248),\"\")","v":""},{"$f":"IF(F246<>\"\",HCDIF(F246,F247,F248),\"\")","v":""},{"$f":"IF(G246<>\"\",HCDIF(G246,G247,G248),\"\")","v":""},{"$f":"IF(H246<>\"\",HCDIF(H246,H247,H248),\"\")","v":""},{"$f":"IF(I246<>\"\",HCDIF(I246,I247,I248),\"\")","v":""},{"$f":"IF(J246<>\"\",HCDIF(J246,J247,J248),\"\")","v":""},{"$f":"IF(K246<>\"\",HCDIF(K246,K247,K248),\"\")","v":""},{"$f":"IF(L246<>\"\",HCDIF(L246,L247,L248),\"\")","v":""},{"$f":"IF(M246<>\"\",HCDIF(M246,M247,M248),\"\")","v":""},{"$f":"IF(N246<>\"\",HCDIF(N246,N247,N248),\"\")","v":""},{"$f":"IF(O246<>\"\",HCDIF(O246,O247,O248),\"\")","v":""},{"$f":"IF(P246<>\"\",HCDIF(P246,P247,P248),\"\")","v":""},{"$f":"IF(Q246<>\"\",HCDIF(Q246,Q247,Q248),\"\")","v":""},{"$f":"IF(R246<>\"\",HCDIF(R246,R247,R248),\"\")","v":""},{"$f":"IF(S246<>\"\",HCDIF(S246,S247,S248),\"\")","v":""},{"$f":"IF(T246<>\"\",HCDIF(T246,T247,T248),\"\")","v":""},{"$f":"IF(U246<>\"\",HCDIF(U246,U247,U248),\"\")","v":""},{"$f":"IF(V246<>\"\",HCDIF(V246,V247,V248),\"\")","v":""},{"$f":"IF(W246<>\"\",HCDIF(W246,W247,W248),\"\")","v":""},"INDEX:",{"$f":"IF(Y248<>\"\",HDIND(Y248),\"\")","v":""}]
[null,null,"WON:",null,null,null,null,null,null,null,null,null,null,null,null,null,null,null,null,null,null,null,null,"TOTAL:",{"$f":"IF(D250<>\"\",SUM(D250:W250),\"\")","v":""}]
[null,{"$f":"IF('SCORE CENTER'!A63<>\"\",'SCORE CENTER'!A63,\"\")","v":""},"SCORE:",null,null,null,null,null,null,null,null,null,null,null,null,null,null,null,null,null,null,null,null,"COUNT:",{"$f":"COUNT(D251:W251)","v":0}]
[null,null,"RATING:",null,null,null,null,null,null,null,null,null,null,null,null,null,null,null,null,null,null,null,null,"-","-"]
[null,null,"SLOPE:",null,null,null,null,null,null,null,null,null,null,null,null,null,null,null,null,null,null,null,null,"HDAVG:",{"$f":"IF(D251<>\"\",Hdavg(D254:W254,Y251),\"\")","v":""}]
[null,null,"DIFF:",{"$f":"IF(D251<>\"\",HCDIF(D251,D252,D253),\"\")","v":""},{"$f":"IF(E251<>\"\",HCDIF(E251,E252,E253),\"\")","v":""},{"$f":"IF(F251<>\"\",HCDIF(F251,F252,F253),\"\")","v":""},{"$f":"IF(G251<>\"\",HCDIF(G251,G252,G253),\"\")","v":""},{"$f":"IF(H251<>\"\",HCDIF(H251,H252,H253),\"\")","v":""},{"$f":"IF(I251<>\"\",HCDIF(I251,I252,I253),\"\")","v":""},{"$f":"IF(J251<>\"\",HCDIF(J251,J252,J253),\"\")","v":""},{"$f":"IF(K251<>\"\",HCDIF(K251,K252,K253),\"\")","v":""},{"$f":"IF(L251<>\"\",HCDIF(L251,L252,L253),\"\")","v":""},{"$f":"IF(M251<>\"\",HCDIF(M251,M252,M253),\"\")","v":""},{"$f":"IF(N251<>\"\",HCDIF(N251,N252,N253),\"\")","v":""},{"$f":"IF(O251<>\"\",HCDIF(O251,O252,O253),\"\")","v":""},{"$f":"IF(P251<>\"\",HCDIF(P251,P252,P253),\"\")","v":""},{"$f":"IF(Q251<>\"\",HCDIF(Q251,Q252,Q253),\"\")","v":""},{"$f":"IF(R251<>\"\",HCDIF(R251,R252,R253),\"\")","v":""},{"$f":"IF(S251<>\"\",HCDIF(S251,S252,S253),\"\")","v":""},{"$f":"IF(T251<>\"\",HCDIF(T251,T252,T253),\"\")","v":""},{"$f":"IF(U251<>\"\",HCDIF(U251,U252,U253),\"\")","v":""},{"$f":"IF(V251<>\"\",HCDIF(V251,V252,V253),\"\")","v":""},{"$f":"IF(W251<>\"\",HCDIF(W251,W252,W253),\"\")","v":""},"INDEX:",{"$f":"IF(Y253<>\"\",HDIND(Y253),\"\")","v":""}]
[null,null,"WON:",null,null,null,null,null,null,null,null,null,null,null,null,null,null,null,null,null,null,null,null,"TOTAL:",{"$f":"IF(D255<>\"\",SUM(D255:W255),\"\")","v":""}]
[null,{"$f":"IF('SCORE CENTER'!A64<>\"\",'SCORE CENTER'!A64,\"\")","v":""},"SCORE:",null,null,null,null,null,null,null,null,null,null,null,null,null,null,null,null,null,null,null,null,"COUNT:",{"$f":"COUNT(D256:W256)","v":0}]
[null,null,"RATING:",null,null,null,null,null,null,null,null,null,null,null,null,null,null,null,null,null,null,null,null,"-","-"]
[null,null,"SLOPE:",null,null,null,null,null,null,null,null,null,null,null,null,null,null,null,null,null,null,null,null,"HDAVG:",{"$f":"IF(D256<>\"\",Hdavg(D259:W259,Y256),\"\")","v":""}]
[null,null,"DIFF:",{"$f":"IF(D256<>\"\",HCDIF(D256,D257,D258),\"\")","v":""},{"$f":"IF(E256<>\"\",HCDIF(E256,E257,E258),\"\")","v":""},{"$f":"IF(F256<>\"\",HCDIF(F256,F257,F258),\"\")","v":""},{"$f":"IF(G256<>\"\",HCDIF(G256,G257,G258),\"\")","v":""},{"$f":"IF(H256<>\"\",HCDIF(H256,H257,H258),\"\")","v":""},{"$f":"IF(I256<>\"\",HCDIF(I256,I257,I258),\"\")","v":""},{"$f":"IF(J256<>\"\",HCDIF(J256,J257,J258),\"\")","v":""},{"$f":"IF(K256<>\"\",HCDIF(K256,K257,K258),\"\")","v":""},{"$f":"IF(L256<>\"\",HCDIF(L256,L257,L258),\"\")","v":""},{"$f":"IF(M256<>\"\",HCDIF(M256,M257,M258),\"\")","v":""},{"$f":"IF(N256<>\"\",HCDIF(N256,N257,N258),\"\")","v":""},{"$f":"IF(O256<>\"\",HCDIF(O256,O257,O258),\"\")","v":""},{"$f":"IF(P256<>\"\",HCDIF(P256,P257,P258),\"\")","v":""},{"$f":"IF(Q256<>\"\",HCDIF(Q256,Q257,Q258),\"\")","v":""},{"$f":"IF(R256<>\"\",HCDIF(R256,R257,R258),\"\")","v":""},{"$f":"IF(S256<>\"\",HCDIF(S256,S257,S258),\"\")","v":""},{"$f":"IF(T256<>\"\",HCDIF(T256,T257,T258),\"\")","v":""},{"$f":"IF(U256<>\"\",HCDIF(U256,U257,U258),\"\")","v":""},{"$f":"IF(V256<>\"\",HCDIF(V256,V257,V258),\"\")","v":""},{"$f":"IF(W256<>\"\",HCDIF(W256,W257,W258),\"\")","v":""},"INDEX:",{"$f":"IF(Y258<>\"\",HDIND(Y258),\"\")","v":""}]
[null,null,"WON:",null,null,null,null,null,null,null,null,null,null,null,null,null,null,null,null,null,null,null,null,"TOTAL:",{"$f":"IF(D260<>\"\",SUM(D260:W260),\"\")","v":""}]
[null,{"$f":"IF('SCORE CENTER'!A65<>\"\",'SCORE CENTER'!A65,\"\")","v":""},"SCORE:",null,null,null,null,null,null,null,null,null,null,null,null,null,null,null,null,null,null,null,null,"COUNT:",{"$f":"COUNT(D261:W261)","v":0}]
[null,null,"RATING:",null,null,null,null,null,null,null,null,null,null,null,null,null,null,null,null,null,null,null,null,"-","-"]
[null,null,"SLOPE:",null,null,null,null,null,null,null,null,null,null,null,null,null,null,null,null,null,null,null,null,"HDAVG:",{"$f":"IF(D261<>\"\",Hdavg(D264:W264,Y261),\"\")","v":""}]
[null,null,"DIFF:",{"$f":"IF(D261<>\"\",HCDIF(D261,D262,D263),\"\")","v":""},{"$f":"IF(E261<>\"\",HCDIF(E261,E262,E263),\"\")","v":""},{"$f":"IF(F261<>\"\",HCDIF(F261,F262,F263),\"\")","v":""},{"$f":"IF(G261<>\"\",HCDIF(G261,G262,G263),\"\")","v":""},{"$f":"IF(H261<>\"\",HCDIF(H261,H262,H263),\"\")","v":""},{"$f":"IF(I261<>\"\",HCDIF(I261,I262,I263),\"\")","v":""},{"$f":"IF(J261<>\"\",HCDIF(J261,J262,J263),\"\")","v":""},{"$f":"IF(K261<>\"\",HCDIF(K261,K262,K263),\"\")","v":""},{"$f":"IF(L261<>\"\",HCDIF(L261,L262,L263),\"\")","v":""},{"$f":"IF(M261<>\"\",HCDIF(M261,M262,M263),\"\")","v":""},{"$f":"IF(N261<>\"\",HCDIF(N261,N262,N263),\"\")","v":""},{"$f":"IF(O261<>\"\",HCDIF(O261,O262,O263),\"\")","v":""},{"$f":"IF(P261<>\"\",HCDIF(P261,P262,P263),\"\")","v":""},{"$f":"IF(Q261<>\"\",HCDIF(Q261,Q262,Q263),\"\")","v":""},{"$f":"IF(R261<>\"\",HCDIF(R261,R262,R263),\"\")","v":""},{"$f":"IF(S261<>\"\",HCDIF(S261,S262,S263),\"\")","v":""},{"$f":"IF(T261<>\"\",HCDIF(T261,T262,T263),\"\")","v":""},{"$f":"IF(U261<>\"\",HCDIF(U261,U262,U263),\"\")","v":""},{"$f":"IF(V261<>\"\",HCDIF(V261,V262,V263),\"\")","v":""},{"$f":"IF(W261<>\"\",HCDIF(W261,W262,W263),\"\")","v":""},"INDEX:",{"$f":"IF(Y263<>\"\",HDIND(Y263),\"\")","v":""}]
[null,null,"WON:",null,null,null,null,null,null,null,null,null,null,null,null,null,null,null,null,null,null,null,null,"TOTAL:",{"$f":"IF(D265<>\"\",SUM(D265:W265),\"\")","v":""}]
[null,{"$f":"IF('SCORE CENTER'!A66<>\"\",'SCORE CENTER'!A65,\"\")","v":""},"SCORE:",null,null,null,null,null,null,null,null,null,null,null,null,null,null,null,null,null,null,null,null,"COUNT:",{"$f":"COUNT(D266:W266)","v":0}]
[null,null,"RATING:",null,null,null,null,null,null,null,null,null,null,null,null,null,null,null,null,null,null,null,null,"-","-"]
[null,null,"SLOPE:",null,null,null,null,null,null,null,null,null,null,null,null,null,null,null,null,null,null,null,null,"HDAVG:",{"$f":"IF(D266<>\"\",Hdavg(D269:W269,Y266),\"\")","v":""}]
[null,null,"DIFF:",{"$f":"IF(D266<>\"\",HCDIF(D266,D267,D268),\"\")","v":""},{"$f":"IF(E266<>\"\",HCDIF(E266,E267,E268),\"\")","v":""},{"$f":"IF(F266<>\"\",HCDIF(F266,F267,F268),\"\")","v":""},{"$f":"IF(G266<>\"\",HCDIF(G266,G267,G268),\"\")","v":""},{"$f":"IF(H266<>\"\",HCDIF(H266,H267,H268),\"\")","v":""},{"$f":"IF(I266<>\"\",HCDIF(I266,I267,I268),\"\")","v":""},{"$f":"IF(J266<>\"\",HCDIF(J266,J267,J268),\"\")","v":""},{"$f":"IF(K266<>\"\",HCDIF(K266,K267,K268),\"\")","v":""},{"$f":"IF(L266<>\"\",HCDIF(L266,L267,L268),\"\")","v":""},{"$f":"IF(M266<>\"\",HCDIF(M266,M267,M268),\"\")","v":""},{"$f":"IF(N266<>\"\",HCDIF(N266,N267,N268),\"\")","v":""},{"$f":"IF(O266<>\"\",HCDIF(O266,O267,O268),\"\")","v":""},{"$f":"IF(P266<>\"\",HCDIF(P266,P267,P268),\"\")","v":""},{"$f":"IF(Q266<>\"\",HCDIF(Q266,Q267,Q268),\"\")","v":""},{"$f":"IF(R266<>\"\",HCDIF(R266,R267,R268),\"\")","v":""},{"$f":"IF(S266<>\"\",HCDIF(S266,S267,S268),\"\")","v":""},{"$f":"IF(T266<>\"\",HCDIF(T266,T267,T268),\"\")","v":""},{"$f":"IF(U266<>\"\",HCDIF(U266,U267,U268),\"\")","v":""},{"$f":"IF(V266<>\"\",HCDIF(V266,V267,V268),\"\")","v":""},{"$f":"IF(W266<>\"\",HCDIF(W266,W267,W268),\"\")","v":""},"INDEX:",{"$f":"IF(Y268<>\"\",HDIND(Y268),\"\")","v":""}]
[null,null,"WON:",null,null,null,null,null,null,null,null,null,null,null,null,null,null,null,null,null,null,null,null,"TOTAL:",{"$f":"IF(D270<>\"\",SUM(D270:W270),\"\")","v":""}]
[null,{"$f":"IF('SCORE CENTER'!A67<>\"\",'SCORE CENTER'!A67,\"\")","v":""},"SCORE:",null,null,null,null,null,null,null,null,null,null,null,null,null,null,null,null,null,null,null,null,"COUNT:",{"$f":"COUNT(D271:W271)","v":0}]
[null,null,"RATING:",null,null,null,null,null,null,null,null,null,null,null,null,null,null,null,null,null,null,null,null,"-","-"]
[null,null,"SLOPE:",null,null,null,null,null,null,null,null,null,null,null,null,null,null,null,null,null,null,null,null,"HDAVG:",{"$f":"IF(D271<>\"\",Hdavg(D274:W274,Y271),\"\")","v":""}]
[null,null,"DIFF:",{"$f":"IF(D271<>\"\",HCDIF(D271,D272,D273),\"\")","v":""},{"$f":"IF(E271<>\"\",HCDIF(E271,E272,E273),\"\")","v":""},{"$f":"IF(F271<>\"\",HCDIF(F271,F272,F273),\"\")","v":""},{"$f":"IF(G271<>\"\",HCDIF(G271,G272,G273),\"\")","v":""},{"$f":"IF(H271<>\"\",HCDIF(H271,H272,H273),\"\")","v":""},{"$f":"IF(I271<>\"\",HCDIF(I271,I272,I273),\"\")","v":""},{"$f":"IF(J271<>\"\",HCDIF(J271,J272,J273),\"\")","v":""},{"$f":"IF(K271<>\"\",HCDIF(K271,K272,K273),\"\")","v":""},{"$f":"IF(L271<>\"\",HCDIF(L271,L272,L273),\"\")","v":""},{"$f":"IF(M271<>\"\",HCDIF(M271,M272,M273),\"\")","v":""},{"$f":"IF(N271<>\"\",HCDIF(N271,N272,N273),\"\")","v":""},{"$f":"IF(O271<>\"\",HCDIF(O271,O272,O273),\"\")","v":""},{"$f":"IF(P271<>\"\",HCDIF(P271,P272,P273),\"\")","v":""},{"$f":"IF(Q271<>\"\",HCDIF(Q271,Q272,Q273),\"\")","v":""},{"$f":"IF(R271<>\"\",HCDIF(R271,R272,R273),\"\")","v":""},{"$f":"IF(S271<>\"\",HCDIF(S271,S272,S273),\"\")","v":""},{"$f":"IF(T271<>\"\",HCDIF(T271,T272,T273),\"\")","v":""},{"$f":"IF(U271<>\"\",HCDIF(U271,U272,U273),\"\")","v":""},{"$f":"IF(V271<>\"\",HCDIF(V271,V272,V273),\"\")","v":""},{"$f":"IF(W271<>\"\",HCDIF(W271,W272,W273),\"\")","v":""},"INDEX:",{"$f":"IF(Y273<>\"\",HDIND(Y273),\"\")","v":""}]
[null,null,"WON:",null,null,null,null,null,null,null,null,null,null,null,null,null,null,null,null,null,null,null,null,"TOTAL:",{"$f":"IF(D275<>\"\",SUM(D275:W275),\"\")","v":""}]